program: Orca
programVersion: 5.0.2
elementType: S P O O O N N C C C C C C C C C C C C C H H H H H H H H H H H H H H H H H H H H H H H
charge: 0
multiplicity: 1
keywords: wb97x-d3
keywords: def2-TZVPP
keywords: def2/J RIJCOSX
keywords: DEFGRID2
keywords: scfconv7
keywords: smallprint printgap noloewdin
keywords: NOSOSCF
formula: C13H23N2O3PS
InChI: InChI=1/C13H23N2O3PS/c1-7-16-19(20,17-10(2)3)18-11-8-14-12(15-9-11)13(4,5)6/h8-10H,7H2,1-6H3
43 atoms
S  1.65932 -0.169933 1.78207
P  1.809044 -0.450003 -0.109112
O  1.903193 0.796718 -1.084817
O  0.548922 -1.224692 -0.784051
O  2.999282 -1.37769 -0.609665
N  -2.694787 -0.820888 0.739737
N  -2.591213 0.509464 -1.196554
C  -4.643524 0.489704 0.145968
C  -5.546395 -0.748066 0.208555
C  -5.14988 1.438135 -0.936711
C  -4.665467 1.2020 1.504487
C  -3.222547 0.037908 -0.131265
C  2.636423 2.025583 -0.872547
C  -0.7239 -0.780265 -0.55235
C  -1.457432 -1.224743 0.537403
C  -1.3473 0.105833 -1.407659
C  1.833467 2.980434 -0.011549
C  4.04006 1.786987 -0.348648
C  3.514794 -2.452844 0.189092
C  4.782144 -2.03386 0.896103
H  -6.573626 -0.453081 0.429961
H  -5.217955 -1.440404 0.982587
H  -5.553606 -1.282114 -0.743398
H  -4.539006 2.337338 -1.007411
H  -5.153105 0.968079 -1.919817
H  -6.172333 1.742273 -0.705927
H  -5.681522 1.520576 1.744532
H  -4.033106 2.091661 1.497413
H  -4.31793 0.546244 2.301899
H  2.708327 2.435262 -1.881819
H  -1.027261 -1.919284 1.251152
H  -0.833898 0.492935 -2.28174
H  1.764812 2.633075 1.018092
H  2.315103 3.958878 -0.01021
H  0.823719 3.107623 -0.40138
H  4.032344 1.409984 0.67431
H  4.583448 2.732191 -0.347614
H  4.59041 1.088052 -0.977662
H  2.768372 -2.788432 0.912469
H  3.699345 -3.272634 -0.504872
H  4.581528 -1.246368 1.621266
H  5.202017 -2.885372 1.432315
H  5.532331 -1.680143 0.18925
totalener: -1584.17379846 hartree
nucrepener: 2018.21130562 hartree
electener: -3602.38510408 hartree
oneelecener: -6185.19722306 hartree
twoeener: 2582.81211898 hartree
kineticenergy: 1578.97289140 hartree
xcener: -118.051118787822 hartree
chargesum: -0.0000000
charge: -0.394401 0.720435 -0.327350 -0.338854 -0.314561 -0.338165 -0.298730 0.255202 -0.316266 -0.276409 -0.317377 0.220568 0.139164 0.212860 -0.008382 -0.027656 -0.255848 -0.270920 0.034766 -0.239504 0.082716 0.103498 0.091197 0.088508 0.089271 0.083574 0.082869 0.092474 0.104996 0.074805 0.117098 0.123283 0.100336 0.086076 0.095065 0.087229 0.093486 0.105555 0.082662 0.096249 0.086017 0.089874 0.084586
qa: -0.3944 0.7204 -0.3273 -0.3389 -0.3146 -0.3382 -0.2987 0.2552 -0.3163 -0.2764 -0.3174 0.2206 0.1392 0.2129 -0.0084 -0.0277 -0.2558 -0.2709 0.0348 -0.2395 0.0827 0.1035 0.0912 0.0885 0.0893 0.0836 0.0829 0.0925 0.1050 0.0748 0.1171 0.1233 0.1003 0.0861 0.0951 0.0872 0.0935 0.1056 0.0827 0.0962 0.0860 0.0899 0.0846
va: 2.0129 5.5306 2.1357 2.1335 2.1190 3.0706 3.0854 3.7192 3.9366 3.9316 3.9385 3.9624 3.8961 3.7436 4.1360 4.1241 3.9275 3.8859 3.8830 3.9072 1.0054 1.0186 1.0061 1.0167 1.0157 1.0041 1.0049 1.0062 1.0170 0.9905 1.0167 1.0123 1.0179 1.0101 1.0087 1.0229 1.0127 1.0099 1.0126 0.9956 1.0174 1.0143 1.0032
dispcorr: -0.021483692 hartree
energy: -1584.195282147175
dipole: -7.47504 8.81835 1.34331 10.40416 -10.32730 0.07686 2.97091 -3.35740 -0.38649
magnitude: 1.39991 au
magnitude: 3.55830 debye
