program: Orca
programVersion: 5.0.2
elementType: S P O O O N N C C C C C C C C C C C C C H H H H H H H H H H H H H H H H H H H H H H H
charge: 0
multiplicity: 1
keywords: wb97x-d3
keywords: def2-TZVPP
keywords: def2/J RIJCOSX
keywords: DEFGRID2
keywords: scfconv7
keywords: smallprint printgap noloewdin
keywords: NOSOSCF
formula: C13H23N2O3PS
InChI: InChI=1/C13H23N2O3PS/c1-7-16-19(20,17-10(2)3)18-11-8-14-12(15-9-11)13(4,5)6/h8-10H,7H2,1-6H3
43 atoms
S  1.907642 0.171715 1.750346
P  1.982744 0.153057 -0.166798
O  3.179044 0.861152 -0.921797
O  0.723643 0.878883 -0.908849
O  1.985268 -1.280002 -0.860839
N  -2.439954 -0.842339 -1.134228
N  -2.486781 0.602405 0.720286
C  -4.457068 -0.73153 0.25462
C  -4.972339 -1.780154 -0.726583
C  -5.360552 0.506522 0.202865
C  -4.46935 -1.308188 1.67561
C  -3.04049 -0.305815 -0.081837
C  3.83109 2.101649 -0.562159
C  -0.548206 0.470336 -0.615434
C  -1.201189 -0.457964 -1.40159
C  -1.252758 0.986483 0.462838
C  2.853761 3.203621 -0.199116
C  4.873567 1.855389 0.511351
C  2.090076 -2.515467 -0.137477
C  0.727903 -3.060651 0.220188
H  -5.989763 -2.065772 -0.453627
H  -4.357932 -2.679905 -0.719859
H  -4.991371 -1.405433 -1.749385
H  -5.023485 1.272627 0.899879
H  -5.379739 0.941771 -0.797814
H  -6.384639 0.234717 0.464832
H  -5.482122 -1.610955 1.947501
H  -4.126612 -0.575318 2.404705
H  -3.829387 -2.18905 1.753167
H  4.33641 2.379645 -1.488671
H  -0.713343 -0.895797 -2.266505
H  -0.802514 1.722184 1.120471
H  2.339923 2.999333 0.740216
H  3.405897 4.135511 -0.075135
H  2.111562 3.359702 -0.980668
H  4.415307 1.601005 1.465767
H  5.471249 2.756865 0.649853
H  5.548722 1.049471 0.225311
H  2.623379 -3.192267 -0.804551
H  2.695982 -2.374946 0.759673
H  0.106703 -3.20242 -0.663648
H  0.840987 -4.029303 0.708017
H  0.206663 -2.398119 0.910754
totalener: -1584.17334171 hartree
nucrepener: 2035.10468474 hartree
electener: -3619.27802645 hartree
oneelecener: -6218.92316216 hartree
twoeener: 2599.64513571 hartree
kineticenergy: 1578.96545762 hartree
xcener: -118.051576646039 hartree
chargesum: 0.0000000
charge: -0.399800 0.717208 -0.314632 -0.337060 -0.328417 -0.288934 -0.336620 0.258693 -0.277368 -0.318089 -0.316145 0.216387 0.139157 0.234569 -0.063754 -0.008280 -0.268220 -0.261023 0.035524 -0.246091 0.084032 0.088121 0.089631 0.103561 0.092044 0.083410 0.083244 0.104922 0.090614 0.074575 0.131480 0.116824 0.090213 0.089211 0.106050 0.099279 0.083786 0.095005 0.097367 0.086934 0.088809 0.096144 0.087636
qa: -0.3998 0.7172 -0.3146 -0.3371 -0.3284 -0.2889 -0.3366 0.2587 -0.2774 -0.3181 -0.3161 0.2164 0.1392 0.2346 -0.0638 -0.0083 -0.2682 -0.2610 0.0355 -0.2461 0.0840 0.0881 0.0896 0.1036 0.0920 0.0834 0.0832 0.1049 0.0906 0.0746 0.1315 0.1168 0.0902 0.0892 0.1061 0.0993 0.0838 0.0950 0.0974 0.0869 0.0888 0.0961 0.0876
va: 2.0079 5.5272 2.1570 2.0960 2.1255 3.0696 3.0718 3.7139 3.9339 3.9364 3.9390 3.9645 3.9038 3.6990 4.1154 4.1386 3.8811 3.9246 3.8619 3.9082 1.0041 1.0159 1.0161 1.0177 1.0061 1.0055 1.0052 1.0173 1.0064 0.9898 1.0093 1.0156 1.0258 1.0111 1.0113 1.0199 1.0100 1.0094 0.9930 1.0175 1.0027 1.0136 1.0136
dispcorr: -0.022203406 hartree
energy: -1584.195545117850
dipole: -14.16746 15.07923 0.91177 -3.88930 3.95435 0.06505 3.76455 -4.14114 -0.37658
magnitude: 0.98862 au
magnitude: 2.51288 debye
