program: Orca
programVersion: 5.0.2
elementType: S P O O O N N C C C C C C C C C C C C C H H H H H H H H H H H H H H H H H H H H H H H
charge: 0
multiplicity: 1
keywords: wb97x-d3
keywords: def2-TZVPP
keywords: def2/J RIJCOSX
keywords: DEFGRID2
keywords: scfconv7
keywords: smallprint printgap noloewdin
keywords: NOSOSCF
formula: C13H23N2O3PS
InChI: InChI=1/C13H23N2O3PS/c1-7-16-19(20,17-10(2)3)18-11-8-14-12(15-9-11)13(4,5)6/h8-10H,7H2,1-6H3
43 atoms
S  1.931714 0.628121 1.746979
P  1.991458 0.167385 -0.114237
O  3.184058 0.680244 -1.016442
O  0.732773 0.703147 -1.001457
O  1.986143 -1.386072 -0.462122
N  -2.411651 -1.054131 -0.960402
N  -2.508518 0.708561 0.592514
C  -4.457986 -0.747696 0.304778
C  -4.411814 -2.167662 0.88384
C  -5.295329 -0.750202 -0.979481
C  -5.087686 0.199732 1.321873
C  -3.040922 -0.329402 -0.036935
C  3.828937 1.97487 -0.970255
C  -0.539593 0.347683 -0.653373
C  -1.173422 -0.720852 -1.26668
C  -1.265209 1.047636 0.292176
C  2.848607 3.127111 -0.852689
C  4.893384 1.99246 0.109271
C  2.086122 -2.423885 0.523985
C  0.719952 -2.874211 0.983452
H  -5.419997 -2.50653 1.128841
H  -3.819596 -2.203799 1.800051
H  -3.981082 -2.871638 0.172489
H  -5.347634 0.246666 -1.420866
H  -4.881163 -1.428622 -1.723976
H  -6.316192 -1.067727 -0.759957
H  -6.104991 -0.127708 1.543605
H  -5.138298 1.221583 0.946713
H  -4.529648 0.223763 2.257055
H  4.314206 2.032274 -1.946205
H  -0.662241 -1.308764 -2.022725
H  -0.834367 1.896485 0.811906
H  2.349391 3.140824 0.11632
H  3.395871 4.0647 -0.953623
H  2.094181 3.098075 -1.637671
H  4.454613 1.958009 1.105432
H  5.478577 2.908805 0.026287
H  5.576747 1.15063 0.001444
H  2.626051 -3.233935 0.034441
H  2.683214 -2.081476 1.371268
H  0.106755 -3.215994 0.149953
H  0.825648 -3.703734 1.683339
H  0.193255 -2.069808 1.496575
totalener: -1584.17349372 hartree
nucrepener: 2034.11189264 hartree
electener: -3618.28538636 hartree
oneelecener: -6216.92612349 hartree
twoeener: 2598.64073713 hartree
kineticenergy: 1578.97351041 hartree
xcener: -118.053078283619 hartree
chargesum: -0.0000000
charge: -0.398427 0.714652 -0.313923 -0.336802 -0.327675 -0.330617 -0.293244 0.256612 -0.320166 -0.315884 -0.275537 0.217086 0.137270 0.234374 -0.065869 -0.007319 -0.267970 -0.258065 0.034341 -0.246392 0.084675 0.093303 0.101540 0.091566 0.102861 0.083108 0.083662 0.089148 0.091208 0.074282 0.132236 0.115588 0.091998 0.088421 0.105998 0.098245 0.083224 0.094680 0.097227 0.087587 0.089858 0.096321 0.086818
qa: -0.3984 0.7147 -0.3139 -0.3368 -0.3277 -0.3306 -0.2932 0.2566 -0.3202 -0.3159 -0.2755 0.2171 0.1373 0.2344 -0.0659 -0.0073 -0.2680 -0.2581 0.0343 -0.2464 0.0847 0.0933 0.1015 0.0916 0.1029 0.0831 0.0837 0.0891 0.0912 0.0743 0.1322 0.1156 0.0920 0.0884 0.1060 0.0982 0.0832 0.0947 0.0972 0.0876 0.0899 0.0963 0.0868
va: 2.0112 5.5314 2.1574 2.0953 2.1250 3.0481 3.0946 3.7173 3.9356 3.9357 3.9322 3.9649 3.9040 3.6974 4.1273 4.1278 3.8796 3.9252 3.8630 3.9068 1.0061 1.0060 1.0165 1.0064 1.0186 1.0056 1.0037 1.0157 1.0166 0.9901 1.0092 1.0171 1.0256 1.0115 1.0114 1.0198 1.0101 1.0096 0.9932 1.0176 1.0029 1.0137 1.0136
dispcorr: -0.022240664 hartree
energy: -1584.195734383364
dipole: -14.25282 15.15530 0.90248 -3.84834 3.77163 -0.07671 3.42963 -3.85489 -0.42526
magnitude: 1.00060 au
magnitude: 2.54333 debye
