program: Orca
programVersion: 5.0.2
elementType: S P O O O N N C C C C C C C C C C C C C H H H H H H H H H H H H H H H H H H H H H H H
charge: 0
multiplicity: 1
keywords: wb97x-d3
keywords: def2-TZVPP
keywords: def2/J RIJCOSX
keywords: DEFGRID2
keywords: scfconv7
keywords: smallprint printgap noloewdin
keywords: NOSOSCF
formula: C13H23N2O3PS
InChI: InChI=1/C13H23N2O3PS/c1-7-16-19(20,17-10(2)3)18-11-8-14-12(15-9-11)13(4,5)6/h8-10H,7H2,1-6H3
43 atoms
S  1.927636 0.141853 1.762402
P  1.976175 0.149461 -0.155852
O  3.181353 0.835022 -0.91631
O  0.727791 0.918852 -0.872525
O  1.931996 -1.273077 -0.869105
N  -2.462524 -0.734616 -1.191853
N  -2.475172 0.575549 0.760761
C  -4.459097 -0.711861 0.23203
C  -5.352654 0.530781 0.32413
C  -4.437416 -1.423153 1.591089
C  -5.009147 -1.659057 -0.830379
C  -3.04602 -0.26907 -0.096702
C  3.881509 2.045395 -0.545803
C  -0.549111 0.513727 -0.597588
C  -1.221071 -0.347503 -1.442154
C  -1.239127 0.963842 0.51903
C  2.946797 3.173657 -0.152865
C  4.928891 1.746122 0.50946
C  1.975282 -2.521702 -0.162332
C  0.588948 -3.004237 0.193217
H  -5.391214 1.063247 -0.627833
H  -4.994283 1.222623 1.08521
H  -6.372787 0.240902 0.581945
H  -4.06195 -0.768132 2.376177
H  -5.445594 -1.739384 1.864758
H  -3.808216 -2.314788 1.563109
H  -4.406318 -2.5619 -0.92111
H  -5.045236 -1.19061 -1.813413
H  -6.024161 -1.957199 -0.56206
H  4.384357 2.320548 -1.474501
H  -0.74568 -0.728717 -2.340198
H  -0.775949 1.648422 1.221242
H  2.200544 3.366426 -0.922348
H  2.437668 2.971144 0.78951
H  3.53103 4.084699 -0.021383
H  5.572434 0.922421 0.202035
H  4.474748 1.492142 1.465911
H  5.558747 2.624418 0.653774
H  2.471958 -3.215096 -0.840494
H  2.590229 -2.423732 0.734256
H  0.655996 -3.985803 0.663577
H  0.104062 -2.329413 0.898334
H  -0.04279 -3.099562 -0.68946
totalener: -1584.17319057 hartree
nucrepener: 2036.83748445 hartree
electener: -3621.01067501 hartree
oneelecener: -6222.38154936 hartree
twoeener: 2601.37087435 hartree
kineticenergy: 1578.96547069 hartree
xcener: -118.051788332398 hartree
chargesum: 0.0000000
charge: -0.400319 0.717282 -0.314604 -0.336689 -0.327436 -0.289148 -0.335835 0.260181 -0.316677 -0.317529 -0.278261 0.215345 0.138208 0.233963 -0.063528 -0.010421 -0.267890 -0.260609 0.034712 -0.248057 0.091575 0.103717 0.083176 0.105509 0.083616 0.090104 0.088216 0.090007 0.084076 0.074457 0.131330 0.117557 0.106190 0.091008 0.088771 0.095190 0.099344 0.083761 0.097650 0.087747 0.096401 0.087556 0.090356
qa: -0.4003 0.7173 -0.3146 -0.3367 -0.3274 -0.2891 -0.3358 0.2602 -0.3167 -0.3175 -0.2783 0.2153 0.1382 0.2340 -0.0635 -0.0104 -0.2679 -0.2606 0.0347 -0.2481 0.0916 0.1037 0.0832 0.1055 0.0836 0.0901 0.0882 0.0900 0.0841 0.0745 0.1313 0.1176 0.1062 0.0910 0.0888 0.0952 0.0993 0.0838 0.0976 0.0877 0.0964 0.0876 0.0904
va: 2.0077 5.5265 2.1573 2.0961 2.1263 3.0682 3.0697 3.7119 3.9360 3.9391 3.9344 3.9632 3.9053 3.6974 4.1115 4.1367 3.8812 3.9242 3.8628 3.9074 1.0062 1.0182 1.0054 1.0170 1.0053 1.0063 1.0161 1.0157 1.0042 0.9897 1.0098 1.0166 1.0114 1.0258 1.0111 1.0093 1.0198 1.0100 0.9929 1.0171 1.0137 1.0127 1.0029
dispcorr: -0.022305466 hartree
energy: -1584.195496032706
dipole: -14.21521 15.11256 0.89735 -4.13363 4.18226 0.04863 3.59445 -3.97078 -0.37633
magnitude: 0.97428 au
magnitude: 2.47642 debye
