program: Orca
programVersion: 5.0.2
elementType: S P O O O N N C C C C C C C C C C C C C H H H H H H H H H H H H H H H H H H H H H H H
charge: 0
multiplicity: 1
keywords: wb97x-d3
keywords: def2-TZVPP
keywords: def2/J RIJCOSX
keywords: DEFGRID2
keywords: scfconv7
keywords: smallprint printgap noloewdin
keywords: NOSOSCF
formula: C13H23N2O3PS
InChI: InChI=1/C13H23N2O3PS/c1-7-16-19(20,17-10(2)3)18-11-8-14-12(15-9-11)13(4,5)6/h8-10H,7H2,1-6H3
43 atoms
S  2.077375 -0.090345 1.772657
P  1.985047 0.171656 -0.125302
O  3.16207 0.912383 -0.879138
O  0.721328 1.071855 -0.631844
O  1.825437 -1.137388 -1.017301
N  -2.480412 -0.482145 -1.191885
N  -2.445764 0.411104 0.982927
C  -4.447496 -0.766649 0.197777
C  -5.356042 -0.184129 -0.891273
C  -4.99026 -0.386044 1.572172
C  -4.412125 -2.294802 0.065445
C  -3.039543 -0.240182 -0.006961
C  3.90947 2.064864 -0.423953
C  -0.550042 0.623537 -0.404178
C  -1.248345 -0.056817 -1.389485
C  -1.208075 0.841867 0.791448
C  3.022939 3.157485 0.144086
C  5.009865 1.638071 0.528247
C  1.838781 -2.471023 -0.487948
C  0.448426 -2.936115 -0.125034
H  -6.369971 -0.572966 -0.780634
H  -5.000024 -0.442804 -1.887606
H  -5.41068 0.903893 -0.822555
H  -4.380904 -0.793066 2.378553
H  -5.028852 0.69453 1.708107
H  -6.003642 -0.775662 1.685968
H  -5.416143 -2.706015 0.185457
H  -3.777657 -2.744529 0.831603
H  -4.035759 -2.600685 -0.91025
H  4.362968 2.4312 -1.346553
H  -0.793961 -0.252959 -2.355707
H  -0.727224 1.372174 1.606222
H  2.564043 2.85925 1.08734
H  3.632637 4.03993 0.340196
H  2.237692 3.445358 -0.553596
H  5.661367 2.488359 0.732208
H  5.621006 0.847458 0.09385
H  4.606611 1.283456 1.475438
H  2.267392 -3.087272 -1.277813
H  2.49946 -2.523345 0.379448
H  0.03283 -2.342418 0.689211
H  -0.230882 -2.885024 -0.975543
H  0.488524 -3.973998 0.207679
totalener: -1584.17310568 hartree
nucrepener: 2038.25987163 hartree
electener: -3622.43297730 hartree
oneelecener: -6225.20757642 hartree
twoeener: 2602.77459912 hartree
kineticenergy: 1578.95933533 hartree
xcener: -118.050634488144 hartree
chargesum: -0.0000000
charge: -0.399093 0.715879 -0.314515 -0.336525 -0.326884 -0.329676 -0.291542 0.258557 -0.315399 -0.275708 -0.320578 0.213533 0.136236 0.235518 -0.067360 -0.011537 -0.265795 -0.258610 0.033843 -0.250519 0.083297 0.102992 0.091561 0.090957 0.089382 0.084212 0.085359 0.092256 0.101229 0.073772 0.131657 0.116950 0.092344 0.088231 0.104903 0.083210 0.095388 0.098989 0.098011 0.088779 0.088059 0.091239 0.097397
qa: -0.3991 0.7159 -0.3145 -0.3365 -0.3269 -0.3297 -0.2915 0.2586 -0.3154 -0.2757 -0.3206 0.2135 0.1362 0.2355 -0.0674 -0.0115 -0.2658 -0.2586 0.0338 -0.2505 0.0833 0.1030 0.0916 0.0910 0.0894 0.0842 0.0854 0.0923 0.1012 0.0738 0.1317 0.1170 0.0923 0.0882 0.1049 0.0832 0.0954 0.0990 0.0980 0.0888 0.0881 0.0912 0.0974
va: 2.0116 5.5274 2.1580 2.0944 2.1254 3.0441 3.0907 3.7150 3.9351 3.9334 3.9344 3.9648 3.9097 3.6977 4.1206 4.1258 3.8813 3.9233 3.8638 3.9072 1.0055 1.0185 1.0063 1.0163 1.0159 1.0036 1.0064 1.0059 1.0169 0.9898 1.0104 1.0178 1.0253 1.0108 1.0122 1.0099 1.0093 1.0201 0.9929 1.0173 1.0115 1.0033 1.0139
dispcorr: -0.022540804 hartree
energy: -1584.195646479454
dipole: -14.46872 15.29556 0.82684 -4.97907 5.04198 0.06291 1.90871 -2.40629 -0.49758
magnitude: 0.96707 au
magnitude: 2.45809 debye
