program: Gaussian 09
title: 000066577
version: EM64L-G09RevD.01
frameworkgroup: C1[X(C14H9Cl2NO)]
method: RPBEPBE
basis: SDD
operation: Freq
keyword: #p
keyword: freq=noraman
keyword: PBEPBE/SDD
title: #p freq=noraman PBEPBE/SDD
converged: NO YES NO NO
title: Mulliken charges:
elementType: Cl Cl O N C C C C C C C C C C C C C C H H H H H H H H H
charge: -0.034169 -0.044687 -0.259355 -0.021636 0.495828 0.463011 -0.135456 -0.095316 -0.355617 -0.493952 -0.303021 -0.347673 0.327692 -0.275890 -0.344219 -0.231294 -0.119262 -0.536272 0.279119 0.269062 0.260453 0.291948 0.250691 0.259515 0.224478 0.224478 0.251545
chargesum: 0.00000
title: Mulliken charges with hydrogens summed into heavy atoms:
elementType: Cl Cl O N C C C C C C C C C C C C C C
charge: -0.034169 -0.044687 -0.259355 -0.021636 0.495828 0.463011 -0.135456 -0.095316 -0.355617 -0.214833 -0.033959 -0.087220 0.327692 0.016058 -0.093528 0.028220 -0.119262 0.164228
polarizability: 3.82116685e+02 -1.37811755e+01 1.89571987e+02 2.81988936e-02 1.56962415e-02 7.11799703e+01
1716.lowfreq: 0.0012 0.0024 0.0028 4.6674 5.8772 9.5266 42.6533 78.2199 91.0304
frequency: 42.6018 78.2143 91.0219 112.1861 121.5107 165.2932 168.7951 220.7290 232.0900 255.4004 257.6944 278.4878 300.7789 374.5709 385.5606 409.8109 416.2198 439.3449 473.4820 518.0345 531.1621 548.4795 594.1800 624.4592 634.0834 641.7095 684.2076 732.2983 738.8982 778.7556 800.1286 821.0760 832.9272 873.3607 884.6963 891.1428 915.0266 943.8773 966.8578 970.6356 1000.5733 1054.2170 1111.3822 1127.4084 1143.2655 1155.4566 1193.2725 1215.0058 1232.9833 1250.9913 1290.3575 1303.2738 1334.0401 1370.9144 1388.1125 1420.1479 1437.1367 1454.5219 1471.6521 1472.9750 1481.2821 1519.6377 1534.1035 1556.6052 1605.3631 1638.9149 2965.7192 3056.2808 3132.1627 3156.4000 3156.9721 3175.5501 3178.1066 3179.2534 3183.1340
redmass: 6.1598 4.9656 5.1046 4.0613 7.1700 6.3089 13.0764 1.4971 7.9243 5.2761 3.3900 3.5562 8.8923 7.7276 6.3344 3.6309 8.5483 5.9568 3.0730 6.8682 4.7635 3.4268 6.9794 8.1282 4.3105 7.2149 7.0080 3.4612 6.8387 2.2448 8.1614 1.5596 2.0276 5.5567 1.6053 1.5272 6.8209 6.1975 1.3134 1.3269 3.4299 2.1596 1.2545 1.6198 1.4718 1.4075 2.2670 1.6013 3.8627 1.5560 2.7963 4.1315 2.5375 4.1382 6.4465 4.4105 1.3318 2.6992 1.0497 1.1210 3.0559 7.3287 8.8173 9.2531 7.1004 7.0845 1.0330 1.1043 1.0995 1.0869 1.0876 1.0923 1.0964 1.0969 1.0938
irintensity: 0.8898 4.7602 1.0350 1.4684 1.3098 1.7484 0.5712 0.2854 1.3322 5.1573 1.2507 1.5048 3.0704 1.3543 2.3382 5.4985 5.0599 9.2197 0.2932 0.2447 35.3055 16.4646 1.8579 6.4144 0.3077 12.1020 1.2555 0.0145 12.7057 1.1475 16.8298 87.4230 5.9040 16.9893 40.0740 9.7021 112.9790 29.8315 0.5738 0.8371 64.9454 40.3610 0.1989 6.4007 5.4604 37.5558 278.5303 16.7532 16.6096 30.2357 101.8920 2.6795 22.1833 1.4536 47.1683 54.9214 41.2333 91.9225 14.2656 71.4014 53.0471 50.1373 21.3863 6.2286 9.8870 202.8032 95.8896 44.4511 23.4957 2.0077 0.6764 0.3730 16.7188 2.5918 2.7645
temp: 298.150 k
press: 1.00000 atm
elementType: 17 17 8 7 6 6 6 6 6 6 6 6 6 6 6 6 6 6 1 1 1 1 1 1 1 1 1
symmnumber: 1
zpe: 500619.0 jmol-1
zpe.correction: 0.190676 hartree
zpe.thermalcorrener: 0.205642 hartree
zpe.thermalcorrenthalpy: 0.206587 hartree
zpe.thermalcorrgfe: 0.148045 hartree
zpe.sumelectzpe: -1587.744226 hartree
zpe.sumelectthermal: -1587.729260 hartree
zpe.sumelectthermalent: -1587.728315 hartree
zpe.sumelectthermalfe: -1587.786857 hartree
dipole: 4.0793 -0.6028 0.0005
dipole: 4.1236
quadrupole: -97.3674 -113.2157 -121.3103
quadrupole: -17.4066 0.0012 -0.0005
quadrupole: 13.2637 -2.5846 -10.6792 -17.4066 0.0012 -0.0005
hfenergy: -1587.9349018 hartree
pointgroup: C01 [X(C14H9Cl2N1O1)]
dipole: 1.6146187 0.1581648 -0.0002036 debye
polarizability: 383.0037625|4.2815673|188.6849091|-0.027395|0.0170606|71.1799703 unknown
InChI: InChI=1S/C14H9Cl2NO/c1-18-9-3-5-12-11(7-9)14(16)10-4-2-8(15)6-13(10)17-12/h2-7H,1H3
charge 0 multiplicity 1
27 atoms
Cl 0.062102 -3.106844 -0.000642
Cl -5.712701 1.182384 0.000507
O  4.666123 -0.579766 -0.000631
N  -0.543383 1.534877 0.000109
C  0.972869 -0.457797 -0.000313
C  -1.488689 -0.774764 -0.00015
C  0.709743 0.987337 -0.000078
C  -1.616127 0.687356 0.000075
C  -0.173712 -1.295723 -0.00034
C  2.322191 -0.924573 -0.000506
C  1.836055 1.880147 -0.000051
C  -2.686406 -1.57223 -0.000164
C  3.384648 -0.017754 -0.000471
C  -2.931531 1.273208 0.000271
C  3.140463 1.403383 -0.000231
C  -3.943256 -0.978896 0.00003
C  -4.044948 0.451039 0.000246
C  5.825394 0.318954 -0.000765
H  2.537272 -1.99598 -0.000675
H  1.617494 2.951959 0.000136
H  -2.59691 -2.662401 -0.000323
H  -3.001482 2.36355 0.000438
H  3.97599 2.109138 -0.000186
H  -4.852495 -1.586454 0.000024
H  5.844754 0.954928 0.905135
H  5.844366 0.955158 -0.90651
H  6.69838 -0.349138 -0.001036
