program: Orca
programVersion: 5.0.2
elementType: S P O O O N N C C C C C C C C C C C C H H H H H H H H H H H H H H H
charge: 0
multiplicity: 1
keywords: wb97x-d3
keywords: def2-TZVPP
keywords: def2/J RIJCOSX
keywords: DEFGRID2
keywords: scfconv7
keywords: smallprint printgap noloewdin
keywords: NOSOSCF
formula: C12H15N2O3PS
InChI: InChI=1/C12H15N2O3PS/c1-3-15-18(19,16-4-2)17-12-9-13-10-7-5-6-8-11(10)14-12/h5-9H,3-4H2,1-2H3
34 atoms
S  1.998548 0.70556 1.805999
P  1.974122 0.104693 -0.011798
O  0.860533 -1.034722 -0.393787
O  1.724033 1.147766 -1.178069
O  3.274629 -0.649106 -0.527421
N  -0.978255 0.266612 0.029716
N  -2.550772 -1.993545 -0.42797
C  -2.329934 0.338294 0.123709
C  -3.126102 -0.804977 -0.111211
C  -0.472816 -0.876944 -0.272215
C  2.073917 2.545535 -1.072097
C  4.100854 -1.48035 0.310358
C  -2.94649 1.558626 0.455126
C  -4.527189 -0.710169 -0.015476
C  -1.25934 -2.04046 -0.505973
C  -4.312408 1.625463 0.545656
C  -5.107784 0.487793 0.307586
C  0.872843 3.377365 -0.701686
C  3.456546 -2.805446 0.634716
H  2.883198 2.68262 -0.352171
H  2.456563 2.819862 -2.054386
H  5.014771 -1.623898 -0.263902
H  4.358445 -0.933718 1.21976
H  -2.326818 2.427874 0.63499
H  -5.123531 -1.59446 -0.200582
H  -0.78308 -2.982037 -0.75664
H  -4.789038 2.562675 0.801792
H  0.518415 3.147324 0.302494
H  1.152798 4.431432 -0.725089
H  0.052871 3.234839 -1.405881
H  2.588714 -2.694641 1.28554
H  3.154046 -3.338289 -0.266938
H  4.182019 -3.427008 1.161083
H  -6.184328 0.564857 0.383285
elementType: S P O N C H
totalener: -1541.24914974 hartree
nucrepener: 1783.30771494 hartree
electener: -3324.55686468 hartree
oneelecener: -5660.45373981 hartree
twoeener: 2335.89687513 hartree
cpcmener: -0.02015474 hartree
kineticenergy: 1536.37191130 hartree
xcener: -112.647297258617 hartree
chargesum: 0.0000000
charge: -0.436627 0.768228 -0.310857 -0.339623 -0.343507 -0.322244 -0.291615 0.159742 0.150277 0.372688 0.045655 0.024950 -0.217937 -0.199015 -0.023866 -0.109103 -0.131431 -0.242669 -0.236538 0.089594 0.107368 0.107263 0.093532 0.154008 0.140829 0.139230 0.159866 0.074393 0.101431 0.088758 0.080435 0.090273 0.098446 0.158064
qa: -0.4366 0.7682 -0.3109 -0.3396 -0.3435 -0.3222 -0.2916 0.1597 0.1503 0.3727 0.0457 0.0250 -0.2179 -0.1990 -0.0239 -0.1091 -0.1314 -0.2427 -0.2365 0.0896 0.1074 0.1073 0.0935 0.1540 0.1408 0.1392 0.1599 0.0744 0.1014 0.0888 0.0804 0.0903 0.0984 0.1581
va: 1.9835 5.4761 2.1699 2.1104 2.1259 3.0519 3.1137 3.8902 3.8215 3.9191 3.8533 3.8755 3.9226 4.0348 4.0383 3.9209 3.9254 3.9079 3.8871 1.0089 0.9958 0.9917 1.0101 1.0039 1.0201 1.0016 0.9893 1.0178 1.0113 1.0043 1.0168 1.0063 1.0091 0.9893
dispcorr: -0.015722679 hartree
energy: -1541.264872419330
dipole: 4.35355 -4.08698 0.26657 4.24393 -3.93238 0.31155 -0.93937 0.37773 -0.56163
magnitude: 0.69538 au
magnitude: 1.76753 debye
