program: Orca
programVersion: 5.0.2
elementType: S P O O O N N C C C C C C C C C C C C H H H H H H H H H H H H H H H
charge: 0
multiplicity: 1
keywords: wb97x-d3
keywords: def2-TZVPP
keywords: def2/J RIJCOSX
keywords: DEFGRID2
keywords: scfconv7
keywords: smallprint printgap noloewdin
keywords: NOSOSCF
formula: C12H15N2O3PS
InChI: InChI=1/C12H15N2O3PS/c1-3-15-18(19,16-4-2)17-12-9-13-10-7-5-6-8-11(10)14-12/h5-9H,3-4H2,1-2H3
34 atoms
S  1.613903 0.401756 2.413259
P  1.882506 -0.15533 0.606017
O  0.78861 -1.238794 0.014836
O  1.96871 0.949551 -0.531999
O  3.193319 -1.013931 0.414484
N  -0.95915 0.226924 0.122103
N  -2.647078 -1.872406 -0.602116
C  -2.294956 0.430433 0.003459
C  -3.150153 -0.634073 -0.359212
C  -0.523087 -0.963521 -0.101791
C  1.466095 2.29752 -0.418353
C  3.710501 -1.497528 -0.847208
C  -2.83615 1.706122 0.244565
C  -4.534791 -0.40797 -0.470122
C  -1.369773 -2.044409 -0.477439
C  -4.188327 1.900771 0.133093
C  -5.043234 0.840674 -0.225576
C  0.742203 2.661634 -1.688241
C  5.215108 -1.455183 -0.78189
H  0.810201 2.382396 0.447438
H  2.325776 2.948313 -0.25386
H  3.349449 -2.517172 -0.987823
H  3.343854 -0.891321 -1.676666
H  -2.17252 2.515795 0.520919
H  -5.174973 -1.235372 -0.748173
H  -0.950891 -3.026652 -0.667057
H  -4.607362 2.880141 0.323873
H  -0.121149 2.018124 -1.855523
H  0.385482 3.689407 -1.613189
H  1.39679 2.600359 -2.558362
H  5.579215 -0.434241 -0.66407
H  5.59767 -2.059493 0.041201
H  5.627432 -1.854721 -1.708752
H  -6.107385 1.018071 -0.306809
elementType: S P O N C H
totalener: -1541.24900347 hartree
nucrepener: 1780.79679012 hartree
electener: -3322.04579359 hartree
oneelecener: -5654.91079333 hartree
twoeener: 2332.86499974 hartree
cpcmener: -0.02153564 hartree
kineticenergy: 1536.36983032 hartree
xcener: -112.646442955308 hartree
chargesum: 0.0000000
charge: -0.424255 0.728081 -0.310920 -0.332962 -0.338153 -0.340229 -0.289547 0.168322 0.131959 0.389505 0.047941 0.037988 -0.221882 -0.193529 -0.021332 -0.100427 -0.134604 -0.252104 -0.239565 0.090373 0.117161 0.100888 0.101619 0.152764 0.140432 0.139668 0.160162 0.081514 0.093285 0.095684 0.086681 0.089426 0.087989 0.158065
qa: -0.4243 0.7281 -0.3109 -0.3330 -0.3382 -0.3402 -0.2895 0.1683 0.1320 0.3895 0.0479 0.0380 -0.2219 -0.1935 -0.0213 -0.1004 -0.1346 -0.2521 -0.2396 0.0904 0.1172 0.1009 0.1016 0.1528 0.1404 0.1397 0.1602 0.0815 0.0933 0.0957 0.0867 0.0894 0.0880 0.1581
va: 2.0101 5.5149 2.1463 2.0788 2.1442 3.0100 3.1224 3.8561 3.8568 3.8882 3.8057 3.8499 3.9119 4.0406 4.0375 3.9078 3.9293 3.9378 3.9573 1.0177 0.9980 0.9928 0.9961 1.0051 1.0204 1.0017 0.9893 1.0078 1.0068 1.0047 1.0061 1.0037 1.0069 0.9894
dispcorr: -0.015901574 hartree
energy: -1541.264905046166
dipole: 6.59216 -6.75227 -0.16011 7.35626 -6.74077 0.61550 -12.30928 10.17575 -2.13353
magnitude: 2.22630 au
magnitude: 5.65881 debye
