program: Orca
programVersion: 5.0.2
elementType: S P O O O N N C C C C C C C C C C C C H H H H H H H H H H H H H H H
charge: 0
multiplicity: 1
keywords: wb97x-d3
keywords: def2-TZVPP
keywords: def2/J RIJCOSX
keywords: DEFGRID2
keywords: scfconv7
keywords: smallprint printgap noloewdin
keywords: NOSOSCF
formula: C12H15N2O3PS
InChI: InChI=1/C12H15N2O3PS/c1-3-15-18(19,16-4-2)17-12-9-13-10-7-5-6-8-11(10)14-12/h5-9H,3-4H2,1-2H3
34 atoms
S  1.531426 1.95196 1.453811
P  1.800072 0.721482 0.016891
O  0.596785 0.651107 -1.106744
O  2.988656 1.13519 -0.939372
O  2.059788 -0.809319 0.351098
N  -0.927665 -0.283841 0.317867
N  -2.866051 0.115708 -1.649593
C  -2.215967 -0.648082 0.538178
C  -3.198102 -0.441245 -0.456348
C  -0.655764 0.250443 -0.82144
C  3.399262 0.389663 -2.111771
C  1.919209 -1.397092 1.660095
C  -2.581798 -1.230952 1.765151
C  -4.532571 -0.812604 -0.206185
C  -1.63138 0.457134 -1.837507
C  -3.887655 -1.583954 1.985428
C  -4.869139 -1.372935 0.997626
C  3.150176 1.207499 -3.351756
C  3.254775 -1.478142 2.353163
H  4.462065 0.188482 -1.979825
H  2.888171 -0.572779 -2.169461
H  1.203008 -0.826465 2.251542
H  1.498776 -2.387577 1.490082
H  -1.822139 -1.387557 2.520265
H  -5.273382 -0.64323 -0.977078
H  -1.34882 0.905865 -2.783571
H  -4.171497 -2.030356 2.929504
H  3.663139 2.168412 -3.306742
H  3.533125 0.666123 -4.217607
H  2.087282 1.386502 -3.512604
H  3.662686 -0.486859 2.552773
H  3.130572 -1.986629 3.310264
H  3.980035 -2.042852 1.767008
H  -5.894372 -1.656308 1.195527
elementType: S P O N C H
totalener: -1541.24945607 hartree
nucrepener: 1776.82588998 hartree
electener: -3318.07534605 hartree
oneelecener: -5647.08771472 hartree
twoeener: 2329.01236867 hartree
cpcmener: -0.02144962 hartree
kineticenergy: 1536.36888214 hartree
xcener: -112.645904674657 hartree
chargesum: 0.0000000
charge: -0.419511 0.725130 -0.307653 -0.342704 -0.331813 -0.337098 -0.290601 0.161990 0.151884 0.376846 0.041107 0.057150 -0.219847 -0.199018 -0.021411 -0.108544 -0.130241 -0.243079 -0.235258 0.106749 0.097964 0.082491 0.108631 0.152552 0.140278 0.139717 0.159961 0.089454 0.092619 0.083419 0.078427 0.092790 0.089528 0.158090
qa: -0.4195 0.7251 -0.3077 -0.3427 -0.3318 -0.3371 -0.2906 0.1620 0.1519 0.3768 0.0411 0.0572 -0.2198 -0.1990 -0.0214 -0.1085 -0.1302 -0.2431 -0.2353 0.1067 0.0980 0.0825 0.1086 0.1526 0.1403 0.1397 0.1600 0.0895 0.0926 0.0834 0.0784 0.0928 0.0895 0.1581
va: 2.0140 5.5024 2.1492 2.1248 2.0707 3.0437 3.1144 3.8820 3.8240 3.9154 3.8485 3.8275 3.9263 4.0384 4.0332 3.9160 3.9229 3.9387 3.9531 0.9954 1.0008 1.0163 0.9911 1.0050 1.0204 1.0016 0.9893 1.0036 1.0076 1.0099 1.0149 1.0087 1.0048 0.9894
dispcorr: -0.015515439 hartree
energy: -1541.264971510921
dipole: 8.78655 -8.68851 0.09803 -9.27219 7.24893 -2.02326 -1.25438 0.66540 -0.58898
magnitude: 2.10952 au
magnitude: 5.36198 debye
