program: Orca
programVersion: 5.0.2
elementType: S P O O O N N C C C C C C C C C C C C H H H H H H H H H H H H H H H
charge: 0
multiplicity: 1
keywords: wb97x-d3
keywords: def2-TZVPP
keywords: def2/J RIJCOSX
keywords: DEFGRID2
keywords: scfconv7
keywords: smallprint printgap noloewdin
keywords: NOSOSCF
formula: C12H15N2O3PS
InChI: InChI=1/C12H15N2O3PS/c1-3-15-18(19,16-4-2)17-12-9-13-10-7-5-6-8-11(10)14-12/h5-9H,3-4H2,1-2H3
34 atoms
S  1.773041 0.115264 2.098317
P  1.829608 -0.237918 0.217112
O  0.685046 -1.253258 -0.378568
O  1.809801 1.006296 -0.769089
O  3.039591 -1.105336 -0.334065
N  -1.017087 0.198322 0.084499
N  -2.806185 -1.762633 -0.764759
C  -2.352889 0.431052 0.113603
C  -3.259349 -0.56327 -0.316843
C  -0.627443 -0.954412 -0.334923
C  1.36602 2.334426 -0.420112
C  4.398078 -0.784497 0.04187
C  -2.841442 1.665665 0.578144
C  -4.643005 -0.30693 -0.277462
C  -1.527276 -1.966296 -0.774477
C  -4.193099 1.88991 0.610645
C  -5.099132 0.901012 0.180501
C  0.583232 2.905417 -1.573632
C  4.923043 -1.790434 1.032783
H  0.763332 2.305637 0.487088
H  2.256005 2.930715 -0.214097
H  4.972147 -0.802621 -0.883841
H  4.46169 0.228585 0.446306
H  -2.137727 2.419433 0.907716
H  -5.326161 -1.078134 -0.609565
H  -1.150752 -2.920405 -1.126041
H  -4.572299 2.837123 0.971392
H  0.275153 3.922016 -1.325877
H  1.180524 2.952663 -2.484687
H  -0.31606 2.323543 -1.775828
H  4.373498 -1.748998 1.973036
H  4.86813 -2.805656 0.639184
H  5.970144 -1.570725 1.244912
H  -6.161956 1.100352 0.216332
elementType: S P O N C H
totalener: -1541.24865340 hartree
nucrepener: 1781.99833496 hartree
electener: -3323.24698835 hartree
oneelecener: -5657.51934794 hartree
twoeener: 2334.27235959 hartree
cpcmener: -0.01969456 hartree
kineticenergy: 1536.37448128 hartree
xcener: -112.647618160647 hartree
chargesum: 0.0000000
charge: -0.441144 0.764590 -0.313019 -0.338885 -0.340056 -0.335533 -0.289151 0.164638 0.135694 0.382266 0.049857 0.034398 -0.224429 -0.193133 -0.020331 -0.098727 -0.134915 -0.249121 -0.231636 0.092212 0.116492 0.106692 0.086791 0.152846 0.140418 0.140245 0.159391 0.091776 0.094992 0.080618 0.075266 0.089362 0.093192 0.158343
qa: -0.4411 0.7646 -0.3130 -0.3389 -0.3401 -0.3355 -0.2892 0.1646 0.1357 0.3823 0.0499 0.0344 -0.2244 -0.1931 -0.0203 -0.0987 -0.1349 -0.2491 -0.2316 0.0922 0.1165 0.1067 0.0868 0.1528 0.1404 0.1402 0.1594 0.0918 0.0950 0.0806 0.0753 0.0894 0.0932 0.1583
va: 1.9782 5.4920 2.1861 2.0910 2.1164 3.0147 3.1214 3.8590 3.8546 3.8948 3.7990 3.8839 3.9089 4.0403 4.0390 3.9068 3.9280 3.9486 3.9304 1.0150 0.9973 0.9956 1.0033 1.0050 1.0202 1.0012 0.9895 1.0060 1.0051 1.0079 1.0192 1.0044 1.0081 0.9893
dispcorr: -0.015877224 hartree
energy: -1541.264530620676
dipole: 7.30721 -7.12279 0.18442 9.29001 -8.03924 1.25077 -2.84951 2.08951 -0.76000
magnitude: 1.47514 au
magnitude: 3.74951 debye
