program: Gaussian 09
title: 000006001
version: EM64L-G09RevD.01
frameworkgroup: C1[X(C20H16)]
method: RPBEPBE
basis: SDD
operation: Freq
keyword: #p
keyword: freq=noraman
keyword: PBEPBE/SDD
title: #p freq=noraman PBEPBE/SDD
converged: YES YES NO NO
title: Mulliken charges:
elementType: C C C C C C C C C C C C C C C C C C C C H H H H H H H H H H H H H H H H
charge: 0.143437 0.305467 0.020153 -0.017996 0.241499 0.296664 0.133825 0.416685 -0.432366 -0.510510 -0.880044 -0.832796 -0.396110 -0.436905 -0.362756 -0.452411 -0.271632 -0.266635 -0.267406 -0.253469 0.251017 0.233934 0.273687 0.223312 0.239071 0.235215 0.237998 0.236586 0.250035 0.226643 0.263866 0.240591 0.227208 0.227171 0.227395 0.229575
chargesum: 0.00000
title: Mulliken charges with hydrogens summed into heavy atoms:
elementType: C C C C C C C C C C C C C C C C C C C C
charge: 0.143437 0.305467 0.020153 -0.017996 0.241499 0.296664 0.133825 0.416685 -0.181348 -0.276577 -0.143974 -0.122996 -0.146075 -0.210261 -0.098890 -0.211821 -0.044424 -0.039463 -0.040011 -0.023894
polarizability: 4.00806630e+02 -3.58717474e+00 2.40232900e+02 -3.73390947e+00 4.25783143e+00 9.48327533e+01
1716.lowfreq: -11.3357 -3.1094 -0.0002 0.0004 0.0008 1.7523 51.9083 61.9771 103.8782
frequency: 51.8906 61.9730 103.8718 125.1376 146.1362 172.7228 192.5484 226.4984 269.1845 279.2349 306.7671 338.5612 358.8478 364.9095 385.9436 417.6316 441.6333 452.3126 471.2284 513.5632 519.5033 537.5516 544.3486 586.6108 594.4674 610.2626 620.5543 651.1449 698.6226 710.0878 759.1866 761.3663 770.5859 780.3369 806.0284 811.7509 834.7398 876.9201 878.2437 885.9727 923.0174 955.7833 958.4730 978.1364 985.0967 989.1044 1003.2441 1025.0206 1034.5261 1037.3291 1045.7723 1058.4121 1067.1852 1078.9598 1113.1730 1152.5477 1177.6642 1178.7592 1185.1873 1234.5856 1241.5248 1267.4991 1291.9901 1306.1047 1337.0807 1368.8091 1378.0697 1392.6280 1397.7625 1402.7413 1414.2767 1428.3598 1434.8014 1451.2540 1467.7656 1481.9916 1482.8862 1498.2479 1499.3575 1510.5357 1547.7715 1562.2201 1567.5430 1612.4976 1614.8143 1629.3726 2967.7752 2981.9645 3050.0740 3051.5904 3102.2385 3119.5715 3120.0462 3125.2768 3127.7380 3133.9505 3144.0623 3157.5181 3161.9545 3169.9160 3171.0085 3193.4214
redmass: 3.8770 3.4697 2.5712 3.2446 1.4174 3.2176 3.6824 3.5020 3.9577 1.6209 4.0420 3.4812 3.8739 3.4327 2.2917 3.2799 5.0896 2.8648 4.8762 3.6105 4.6078 4.5818 4.1010 3.3947 4.2335 4.4054 3.6801 6.1295 3.2333 5.0659 1.4478 1.2878 3.6333 2.6389 3.7971 2.3710 1.7462 3.3897 2.3126 1.5854 3.4200 1.3663 1.3663 1.3749 1.3356 1.3634 2.9723 2.5742 1.5831 1.6281 2.3543 1.9102 2.2712 2.6079 2.2369 1.6055 1.1437 1.1551 1.2400 1.9303 1.5864 1.6883 2.1861 2.7421 4.1558 3.4176 3.9109 4.7832 1.2689 1.2282 2.2502 2.7423 4.5488 2.2800 1.5034 1.1934 1.0617 2.4227 1.3120 1.5270 5.4480 5.2709 7.2918 6.1026 6.0709 6.5014 1.0442 1.0419 1.0975 1.0918 1.0967 1.0920 1.0877 1.0885 1.0855 1.0902 1.0891 1.0983 1.0930 1.0944 1.0981 1.0929
irintensity: 0.1622 0.0323 0.1620 0.3105 3.7665 1.8805 0.4767 2.2061 0.3375 0.4798 0.3324 1.6426 0.5318 0.8012 1.8182 3.6695 1.2805 0.4198 1.4696 1.8530 3.2598 4.0474 9.1832 2.6330 4.4423 0.4512 0.2235 0.2640 6.7226 6.3299 57.4410 78.1676 6.4701 0.8467 2.0501 9.8481 48.9746 1.7183 2.1201 8.4705 8.8153 0.7092 3.3025 1.5656 0.0511 0.9152 5.4808 9.3215 2.8037 0.8177 5.9617 1.5007 1.0008 0.1719 2.7148 2.5218 2.3471 0.9628 1.4060 3.0826 1.8107 4.5680 0.8567 1.6426 3.2956 13.7602 14.6365 4.7186 11.4222 12.0949 3.0647 0.8913 2.3205 6.8915 5.1744 8.8142 13.1005 21.4650 15.0549 20.4548 2.5333 0.7356 1.0207 0.7767 0.6752 2.5988 31.6028 34.8125 17.5322 21.2422 10.1900 14.4788 5.4248 8.9143 1.1703 16.8130 9.4097 45.5434 34.6124 34.3383 32.2354 11.7880
temp: 298.150 k
press: 1.00000 atm
elementType: 6 6 6 6 6 6 6 6 6 6 6 6 6 6 6 6 6 6 6 6 1 1 1 1 1 1 1 1 1 1 1 1 1 1 1 1
symmnumber: 1
zpe: 768402.5 jmol-1
zpe.correction: 0.292669 hartree
zpe.thermalcorrener: 0.308035 hartree
zpe.thermalcorrenthalpy: 0.308979 hartree
zpe.thermalcorrgfe: 0.250934 hartree
zpe.sumelectzpe: -770.402877 hartree
zpe.sumelectthermal: -770.387512 hartree
zpe.sumelectthermalent: -770.386567 hartree
zpe.sumelectthermalfe: -770.444613 hartree
dipole: 0.0833 0.0965 -0.0362
dipole: 0.1325
quadrupole: -102.7120 -100.4304 -124.2818
quadrupole: 0.4485 -0.5106 0.8669
quadrupole: 6.4294 8.7110 -15.1404 0.4485 -0.5106 0.8669
hfenergy: -770.6955463 hartree
pointgroup: C01 [X(C20H16)]
dipole: -0.0323859 -0.0385806 -0.0134407 debye
polarizability: 400.8503897|-1.9377792|239.9262871|4.2246991|-7.3787298|95.0956063 unknown
InChI: InChI=1S/C20H16/c1-13-16-8-5-6-9-17(16)14(2)20-18(13)12-11-15-7-3-4-10-19(15)20/h3-12H,1-2H3
charge 0 multiplicity 1
36 atoms
C  0.445773 0.126201 0.065372
C  -0.02099 -1.260924 0.064532
C  -0.517832 1.16618 0.209011
C  -1.404284 -1.585168 -0.018751
C  -1.915683 0.853821 0.061738
C  -2.364939 -0.524118 -0.100899
C  1.902562 0.363122 -0.058479
C  2.822256 -0.731445 0.137729
C  0.958055 -2.324747 0.218216
C  2.306629 -2.071045 0.318133
C  -0.150972 2.586116 0.627179
C  -1.830473 -3.047133 -0.004253
C  -2.907185 1.899586 0.042995
C  -3.773745 -0.761542 -0.295239
C  2.469493 1.612727 -0.462638
C  4.230349 -0.51518 0.06875
C  -4.26064 1.629022 -0.145793
C  -4.699409 0.278895 -0.319505
C  3.859039 1.804697 -0.554177
C  4.754167 0.744454 -0.25326
H  0.6056 -3.357409 0.279919
H  3.01952 -2.889522 0.473843
H  0.836328 2.619646 1.111282
H  -0.140831 3.306692 -0.21498
H  -0.884979 2.95994 1.362324
H  -2.919729 -3.171064 -0.073219
H  -1.382081 -3.610112 -0.8443
H  -1.512556 -3.545743 0.930835
H  -2.588793 2.940556 0.144881
H  -4.135085 -1.782912 -0.440358
H  1.816575 2.433107 -0.763085
H  4.900906 -1.365181 0.243688
H  -4.987812 2.448018 -0.173377
H  -5.762371 0.065549 -0.477245
H  4.249861 2.776625 -0.875246
H  5.836876 0.900792 -0.308424
