program: Orca
programVersion: 5.0.2
elementType: S P O O O N N C C C C C C C C C C C C H H H H H H H H H H H H H H H
charge: 0
multiplicity: 1
keywords: wb97x-d3
keywords: def2-TZVPP
keywords: def2/J RIJCOSX
keywords: DEFGRID2
keywords: scfconv7
keywords: smallprint printgap noloewdin
keywords: NOSOSCF
formula: C12H15N2O3PS
InChI: InChI=1/C12H15N2O3PS/c1-3-15-18(19,16-4-2)17-12-9-13-10-7-5-6-8-11(10)14-12/h5-9H,3-4H2,1-2H3
34 atoms
S  1.387146 2.367974 0.379106
P  1.793336 0.624393 -0.280887
O  0.639774 -0.020112 -1.274689
O  3.034866 0.466985 -1.257484
O  2.11092 -0.548705 0.733728
N  -0.895279 -0.247027 0.403787
N  -2.779993 -0.923853 -1.543104
C  -2.171744 -0.539575 0.753269
C  -3.123701 -0.887889 -0.23106
C  -0.604446 -0.288569 -0.851719
C  3.37369 1.476993 -2.218528
C  1.829609 -0.484819 2.139365
C  -2.55617 -0.501714 2.105947
C  -4.441111 -1.199754 0.153409
C  -1.559521 -0.628294 -1.854046
C  -3.84499 -0.806084 2.454774
C  -4.793365 -1.159237 1.475623
C  4.590459 2.246061 -1.761681
C  1.37277 -1.846941 2.599839
H  3.563159 0.95079 -3.154543
H  2.53426 2.157128 -2.381396
H  2.746573 -0.181774 2.648323
H  1.069012 0.270801 2.33844
H  -1.818804 -0.224183 2.847616
H  -5.151645 -1.465385 -0.617893
H  -1.269073 -0.647945 -2.898861
H  -4.142201 -0.774116 3.494704
H  5.434413 1.581059 -1.580962
H  4.883583 2.962127 -2.530185
H  4.378044 2.798588 -0.84696
H  0.440055 -2.129752 2.11343
H  2.119614 -2.612951 2.392593
H  1.202889 -1.828805 3.676899
H  -5.805285 -1.397199 1.774536
totalener: -1541.23112121 hartree
nucrepener: 1782.71203456 hartree
electener: -3323.94315577 hartree
oneelecener: -5658.28427840 hartree
twoeener: 2334.34112263 hartree
kineticenergy: 1536.41045691 hartree
xcener: -112.653619981537 hartree
chargesum: 0.0000000
charge: -0.382317 0.726387 -0.309326 -0.310817 -0.311620 -0.333415 -0.237109 0.163866 0.102062 0.373924 0.018155 0.032886 -0.193904 -0.162664 -0.042742 -0.078691 -0.103294 -0.218417 -0.238749 0.093424 0.080026 0.106543 0.091339 0.130651 0.127554 0.120402 0.128401 0.085880 0.079257 0.082521 0.081670 0.092504 0.078360 0.127251
qa: -0.3823 0.7264 -0.3093 -0.3108 -0.3116 -0.3334 -0.2371 0.1639 0.1021 0.3739 0.0182 0.0329 -0.1939 -0.1627 -0.0427 -0.0787 -0.1033 -0.2184 -0.2387 0.0934 0.0800 0.1065 0.0913 0.1307 0.1276 0.1204 0.1284 0.0859 0.0793 0.0825 0.0817 0.0925 0.0784 0.1273
va: 2.0374 5.5092 2.1736 2.1437 2.1291 3.0192 3.1344 3.8958 3.9430 3.8977 3.9086 3.8385 3.9566 4.0597 4.0511 3.9578 3.9593 3.9196 3.9354 0.9949 1.0119 0.9989 1.0154 1.0106 1.0241 1.0045 0.9996 1.0053 1.0112 1.0226 1.0104 1.0075 1.0079 0.9996
dispcorr: -0.015754076 hartree
energy: -1541.246875284331
dipole: 7.61942 -7.58531 0.03411 -2.08073 1.62154 -0.45920 6.00197 -5.74532 0.25665
magnitude: 0.52715 au
magnitude: 1.33992 debye
