program: Orca
programVersion: 5.0.2
elementType: S P O O O N N C C C C C C C C C C C C H H H H H H H H H H H H H H H
charge: 0
multiplicity: 1
keywords: wb97x-d3
keywords: def2-TZVPP
keywords: def2/J RIJCOSX
keywords: DEFGRID2
keywords: scfconv7
keywords: smallprint printgap noloewdin
keywords: NOSOSCF
formula: C12H15N2O3PS
InChI: InChI=1/C12H15N2O3PS/c1-3-15-18(19,16-4-2)17-12-9-13-10-7-5-6-8-11(10)14-12/h5-9H,3-4H2,1-2H3
34 atoms
S  1.321739 2.323494 0.394303
P  1.775979 0.61372 -0.319622
O  0.613329 -0.055001 -1.287454
O  2.979806 0.520734 -1.350102
O  2.195563 -0.554608 0.661445
N  -0.902587 -0.330972 0.399436
N  -2.830952 -0.857661 -1.551721
C  -2.183178 -0.601227 0.751663
C  -3.158443 -0.868227 -0.235278
C  -0.630032 -0.316708 -0.86031
C  3.197621 1.540968 -2.335689
C  1.872232 -0.588879 2.059235
C  -2.549714 -0.616642 2.10947
C  -4.482901 -1.146146 0.151183
C  -1.605593 -0.585369 -1.864509
C  -3.845858 -0.885121 2.460294
C  -4.8190 -1.151369 1.477978
C  4.370018 2.407147 -1.943017
C  1.422865 -1.98292 2.421842
H  3.384704 1.017487 -3.273321
H  2.301605 2.15219 -2.468451
H  2.773034 -0.309358 2.608156
H  1.098229 0.144372 2.287189
H  -1.793473 -0.404168 2.853331
H  -5.211754 -1.346942 -0.622481
H  -1.327409 -0.568251 -2.912616
H  -4.129612 -0.891265 3.504279
H  4.566957 3.138281 -2.727434
H  4.159855 2.947967 -1.021093
H  5.272111 1.812624 -1.802034
H  1.227494 -2.034505 3.493435
H  0.505571 -2.24695 1.897837
H  2.184869 -2.725071 2.185744
H  -5.836551 -1.361141 1.778594
totalener: -1541.23112832 hartree
nucrepener: 1782.97868313 hartree
electener: -3324.20981145 hartree
oneelecener: -5658.80054068 hartree
twoeener: 2334.59072924 hartree
kineticenergy: 1536.41883787 hartree
xcener: -112.655249629263 hartree
chargesum: 0.0000000
charge: -0.382322 0.724512 -0.309999 -0.311081 -0.309509 -0.336519 -0.237128 0.168242 0.101158 0.372798 0.018545 0.036605 -0.191178 -0.162646 -0.042003 -0.079233 -0.102614 -0.218626 -0.239622 0.093242 0.079350 0.105261 0.088839 0.129117 0.127447 0.120405 0.128516 0.079128 0.082872 0.085964 0.078108 0.082089 0.092915 0.127367
qa: -0.3823 0.7245 -0.3100 -0.3111 -0.3095 -0.3365 -0.2371 0.1682 0.1012 0.3728 0.0185 0.0366 -0.1912 -0.1626 -0.0420 -0.0792 -0.1026 -0.2186 -0.2396 0.0932 0.0793 0.1053 0.0888 0.1291 0.1274 0.1204 0.1285 0.0791 0.0829 0.0860 0.0781 0.0821 0.0929 0.1274
va: 2.0369 5.5155 2.1654 2.1435 2.1361 3.0194 3.1350 3.8908 3.9450 3.8981 3.9125 3.8379 3.9599 4.0604 4.0520 3.9571 3.9584 3.9192 3.9320 0.9950 1.0107 0.9984 1.0180 1.0113 1.0242 1.0043 0.9995 1.0110 1.0231 1.0051 1.0082 1.0118 1.0077 0.9996
dispcorr: -0.015807406 hartree
energy: -1541.246935725737
dipole: 7.14259 -7.16322 -0.02063 -2.01629 1.54717 -0.46912 5.16768 -4.95636 0.21131
magnitude: 0.51493 au
magnitude: 1.30885 debye
