program: Orca
programVersion: 5.0.2
elementType: S P O O O O N N C C C C C C C C C C C C C C H H H H H H H H H H H H H H H H H
charge: 0
multiplicity: 1
keywords: wb97x-d3
keywords: def2-TZVPP
keywords: def2/J RIJCOSX
keywords: DEFGRID2
keywords: scfconv7
keywords: smallprint printgap noloewdin
keywords: NOSOSCF
formula: C14H17N2O4PS
InChI: InChI=1/C14H17N2O4PS/c1-3-18-21(22,19-4-2)20-13-10-11-14(17)16(15-13)12-8-6-5-7-9-12/h5-11H,3-4H2,1-2H3
39 atoms
S  4.14459 0.318786 -0.950825
P  2.271782 0.045716 -0.666142
O  1.435083 1.400634 -1.030559
O  1.808867 -0.365463 0.797629
O  1.53353 -1.015757 -1.584971
O  -3.584587 2.387304 0.458049
N  -1.897376 0.945124 -0.060205
N  -0.637965 0.679776 -0.416094
C  -2.64873 -0.211389 0.308589
C  0.143913 1.65325 -0.68972
C  -2.4401 2.20975 0.05562
C  -0.26293 3.016403 -0.675831
C  -1.533572 3.274331 -0.318506
C  -3.868243 -0.478695 -0.295837
C  -2.117795 -1.078572 1.25366
C  2.449059 0.090462 2.009258
C  2.053697 -2.347997 -1.804358
C  -4.563857 -1.625502 0.058846
C  -2.818157 -2.225744 1.596063
C  -4.043756 -2.498879 1.004546
C  2.288129 -0.978754 3.057006
C  1.735498 -3.28492 -0.665169
H  0.43249 3.801407 -0.939848
H  -1.911787 4.286316 -0.27323
H  -4.267692 0.18353 -1.052218
H  -1.161326 -0.86736 1.714583
H  3.504198 0.291325 1.815063
H  1.973788 1.023516 2.313762
H  1.576299 -2.679902 -2.72423
H  3.129067 -2.291775 -1.985266
H  -5.512543 -1.83874 -0.415164
H  -2.403686 -2.902629 2.331353
H  -4.589141 -3.393152 1.275334
H  2.7463 -0.638199 3.985514
H  1.238187 -1.190261 3.260881
H  2.781451 -1.90415 2.759577
H  2.287007 -3.041947 0.242699
H  0.669232 -3.289581 -0.437266
H  2.017215 -4.296844 -0.958454
elementType: S P O N C H
totalener: -1693.87526218 hartree
nucrepener: 2218.47732289 hartree
electener: -3912.35258507 hartree
oneelecener: -6735.36504482 hartree
twoeener: 2823.01245975 hartree
cpcmener: -0.04192979 hartree
kineticenergy: 1688.37399361 hartree
xcener: -126.681825133940 hartree
chargesum: -0.0000000
charge: -0.425682 0.705952 -0.317680 -0.320979 -0.323863 -0.558711 0.087201 -0.237858 0.170925 0.317706 0.378838 -0.143154 -0.151369 -0.215140 -0.204762 0.043763 0.038788 -0.130362 -0.140695 -0.149093 -0.252841 -0.236328 0.164074 0.154065 0.155434 0.149246 0.099091 0.112844 0.110488 0.087503 0.162486 0.160180 0.163087 0.099550 0.092446 0.088387 0.076457 0.088761 0.101242
qa: -0.4257 0.7060 -0.3177 -0.3210 -0.3239 -0.5587 0.0872 -0.2379 0.1709 0.3177 0.3788 -0.1432 -0.1514 -0.2151 -0.2048 0.0438 0.0388 -0.1304 -0.1407 -0.1491 -0.2528 -0.2363 0.1641 0.1541 0.1554 0.1492 0.0991 0.1128 0.1105 0.0875 0.1625 0.1602 0.1631 0.0996 0.0924 0.0884 0.0765 0.0888 0.1012
va: 2.0416 5.5318 2.1667 2.0690 2.0986 1.9457 3.2562 2.8883 3.6109 4.0391 4.1553 3.9382 3.9084 4.0044 3.9829 3.8087 3.8548 3.8972 3.9061 3.8942 3.9499 3.9167 0.9949 1.0000 1.0079 1.0129 1.0151 0.9902 0.9894 1.0121 0.9898 0.9909 0.9879 1.0083 1.0008 1.0023 1.0111 1.0045 1.0101
dispcorr: -0.019768231 hartree
energy: -1693.895030407391
dipole: 0.13465 0.52086 0.65551 -17.60014 16.55741 -1.04273 11.27133 -10.58400 0.68733
magnitude: 1.41046 au
magnitude: 3.58511 debye
