program: Orca
programVersion: 5.0.2
elementType: S P O O O O N N C C C C C C C C C C C C C C H H H H H H H H H H H H H H H H H
charge: 0
multiplicity: 1
keywords: wb97x-d3
keywords: def2-TZVPP
keywords: def2/J RIJCOSX
keywords: DEFGRID2
keywords: scfconv7
keywords: smallprint printgap noloewdin
keywords: NOSOSCF
formula: C14H17N2O4PS
InChI: InChI=1/C14H17N2O4PS/c1-3-18-21(22,19-4-2)20-13-10-11-14(17)16(15-13)12-8-6-5-7-9-12/h5-11H,3-4H2,1-2H3
39 atoms
S  4.120169 0.425258 0.921141
P  2.367819 0.182203 0.197283
O  1.327695 1.304036 0.76719
O  1.664491 -1.221799 0.458922
O  2.139424 0.384858 -1.361571
O  -3.47636 1.918555 -1.463681
N  -2.006742 0.803703 -0.125418
N  -0.802838 0.631742 0.418622
C  -2.915431 -0.269624 0.122935
C  0.107843 1.49761 0.180166
C  -2.363939 1.853198 -0.955268
C  -0.092908 2.654205 -0.61915
C  -1.312488 2.824536 -1.161654
C  -2.51296 -1.562883 -0.178749
C  -4.160877 -0.02281 0.681103
C  1.908017 -2.013237 1.642065
C  3.058419 -0.122621 -2.357113
C  -3.368606 -2.62165 0.084465
C  -5.011294 -1.088579 0.935241
C  -4.619767 -2.386803 0.637524
C  1.28289 -1.420129 2.879531
C  2.997467 -1.622554 -2.505773
H  0.712399 3.35907 -0.774655
H  -1.538665 3.674607 -1.790112
H  -1.536835 -1.744115 -0.610121
H  -4.462042 0.983677 0.937074
H  1.47517 -2.985249 1.41447
H  2.984202 -2.143992 1.767089
H  2.758598 0.371571 -3.278706
H  4.068172 0.209702 -2.109239
H  -3.05558 -3.630532 -0.14821
H  -5.981597 -0.900904 1.374901
H  -5.287102 -3.213681 0.840179
H  1.742371 -0.471772 3.159254
H  0.210825 -1.269448 2.757596
H  1.430304 -2.111764 3.709132
H  3.392453 -2.144515 -1.634424
H  1.980956 -1.967593 -2.69297
H  3.60919 -1.90878 -3.361723
elementType: S P O N C H
totalener: -1693.87486104 hartree
nucrepener: 2214.31744915 hartree
electener: -3908.19231020 hartree
oneelecener: -6727.12080716 hartree
twoeener: 2818.92849696 hartree
cpcmener: -0.03843127 hartree
kineticenergy: 1688.39335416 hartree
xcener: -126.683468011871 hartree
chargesum: 0.0000000
charge: -0.417854 0.719253 -0.343536 -0.333164 -0.327478 -0.553585 0.115876 -0.232203 0.188024 0.294122 0.378890 -0.137565 -0.151671 -0.221791 -0.230236 0.035527 0.019008 -0.118881 -0.122431 -0.159676 -0.242477 -0.235687 0.165844 0.154108 0.145852 0.155553 0.113752 0.100488 0.109721 0.093456 0.162108 0.162938 0.163337 0.082295 0.087670 0.105478 0.081723 0.092489 0.100724
qa: -0.4179 0.7193 -0.3435 -0.3332 -0.3275 -0.5536 0.1159 -0.2322 0.1880 0.2941 0.3789 -0.1376 -0.1517 -0.2218 -0.2302 0.0355 0.0190 -0.1189 -0.1224 -0.1597 -0.2425 -0.2357 0.1658 0.1541 0.1459 0.1556 0.1138 0.1005 0.1097 0.0935 0.1621 0.1629 0.1633 0.0823 0.0877 0.1055 0.0817 0.0925 0.1007
va: 2.0378 5.5001 2.1141 2.0673 2.1084 1.9503 3.2033 2.9363 3.5887 4.0826 4.1560 3.9590 3.9049 4.0083 4.0223 3.8231 3.8692 3.8871 3.8909 3.9051 3.9109 3.8979 0.9927 1.0001 1.0198 1.0081 0.9913 1.0130 0.9902 1.0082 0.9900 0.9896 0.9882 1.0162 1.0098 1.0103 1.0129 1.0047 1.0090
dispcorr: -0.019748675 hartree
energy: -1693.894609719061
dipole: 0.52788 0.22472 0.75261 -15.48073 14.30986 -1.17087 -0.91934 0.63582 -0.28353
magnitude: 1.42047 au
magnitude: 3.61055 debye
