program: Orca
programVersion: 5.0.2
elementType: S P O O O O N N C C C C C C C C C C C C C C H H H H H H H H H H H H H H H H H
charge: 0
multiplicity: 1
keywords: wb97x-d3
keywords: def2-TZVPP
keywords: def2/J RIJCOSX
keywords: DEFGRID2
keywords: scfconv7
keywords: smallprint printgap noloewdin
keywords: NOSOSCF
formula: C14H17N2O4PS
InChI: InChI=1/C14H17N2O4PS/c1-3-18-21(22,19-4-2)20-13-10-11-14(17)16(15-13)12-8-6-5-7-9-12/h5-11H,3-4H2,1-2H3
39 atoms
S  1.625801 -2.036772 -0.213156
P  2.240636 -0.294836 0.290194
O  1.413323 0.98291 -0.301246
O  3.70213 0.120473 -0.167351
O  2.212632 0.072891 1.836381
O  -3.661148 1.897238 1.051018
N  -2.061143 0.809771 -0.149657
N  -0.796233 0.556401 -0.481117
C  -3.015122 -0.052616 -0.772642
C  0.129165 1.237928 0.082264
C  -2.476319 1.754069 0.772945
C  -0.115797 2.271595 1.025879
C  -1.397637 2.524956 1.349193
C  -4.004705 0.474835 -1.58923
C  -2.915699 -1.419886 -0.561765
C  4.345859 -0.42203 -1.341867
C  2.417859 -0.916562 2.870938
C  -4.907735 -0.383744 -2.198262
C  -3.820105 -2.270954 -1.179543
C  -4.817979 -1.754695 -1.995254
C  3.809338 0.182978 -2.614681
C  3.840585 -1.414635 2.921363
H  0.706663 2.830892 1.450731
H  -1.66076 3.296124 2.059773
H  -4.063614 1.54099 -1.764895
H  -2.136263 -1.818347 0.075352
H  5.400384 -0.188771 -1.209841
H  4.237447 -1.507775 -1.342119
H  2.148179 -0.405761 3.793055
H  1.716132 -1.738894 2.721309
H  -5.679727 0.022016 -2.838684
H  -3.744636 -3.338036 -1.017842
H  -5.524894 -2.41999 -2.473075
H  3.884229 1.269761 -2.604817
H  4.398445 -0.184928 -3.454609
H  2.771151 -0.095927 -2.794869
H  3.951884 -2.068413 3.786668
H  4.104147 -1.995632 2.036829
H  4.550312 -0.594629 3.028081
elementType: S P O N C H
totalener: -1693.87527980 hartree
nucrepener: 2184.04258740 hartree
electener: -3877.91786720 hartree
oneelecener: -6667.05685868 hartree
twoeener: 2789.13899148 hartree
cpcmener: -0.03989217 hartree
kineticenergy: 1688.38767747 hartree
xcener: -126.681762770027 hartree
chargesum: 0.0000000
charge: -0.428455 0.757561 -0.335598 -0.348147 -0.349434 -0.556638 0.111837 -0.211205 0.179416 0.257188 0.382075 -0.132664 -0.156117 -0.228297 -0.207643 0.041475 0.033806 -0.118715 -0.123649 -0.158220 -0.238520 -0.236048 0.167304 0.154356 0.158960 0.138886 0.112963 0.094680 0.110472 0.096260 0.163062 0.162101 0.163751 0.091446 0.100106 0.079641 0.099998 0.078925 0.093078
qa: -0.4285 0.7576 -0.3356 -0.3481 -0.3494 -0.5566 0.1118 -0.2112 0.1794 0.2572 0.3821 -0.1327 -0.1561 -0.2283 -0.2076 0.0415 0.0338 -0.1187 -0.1236 -0.1582 -0.2385 -0.2360 0.1673 0.1544 0.1590 0.1389 0.1130 0.0947 0.1105 0.0963 0.1631 0.1621 0.1638 0.0914 0.1001 0.0796 0.1000 0.0789 0.0931
va: 1.9996 5.4760 2.1398 2.1020 2.1139 1.9472 3.1891 2.9321 3.5823 4.1481 4.1594 3.9309 3.9061 4.0236 4.0248 3.8377 3.8563 3.8868 3.8956 3.8992 3.9060 3.9003 0.9938 1.0004 1.0048 1.0243 0.9920 1.0126 0.9921 1.0102 0.9894 0.9898 0.9882 1.0063 1.0086 1.0170 1.0085 1.0165 1.0061
dispcorr: -0.018680919 hartree
energy: -1693.893960717887
dipole: 12.11456 -9.62215 2.49241 -5.86172 5.98085 0.11913 -0.41029 0.78461 0.37432
magnitude: 2.52318 au
magnitude: 6.41341 debye
