program: Gaussian 09
title: 000066555
version: EM64L-G09RevD.01
frameworkgroup: C1[X(C12H9NO)]
method: RPBEPBE
basis: SDD
operation: Freq
keyword: #p
keyword: freq=noraman
keyword: PBEPBE/SDD
title: #p freq=noraman PBEPBE/SDD
converged: NO NO NO NO
title: Mulliken charges:
elementType: O N C C C C C C C C C C C C H H H H H H H H H
charge: -0.245917 -0.072419 0.291668 -0.150787 0.427674 0.210024 -0.437528 -0.374741 -0.408395 -0.436290 0.220920 -0.239512 -0.239764 -0.764027 0.242704 0.252610 0.270172 0.240596 0.230203 0.227898 0.259717 0.247596 0.247597
chargesum: 0.00000
title: Mulliken charges with hydrogens summed into heavy atoms:
elementType: O N C C C C C C C C C C C C
charge: -0.245917 -0.072419 0.291668 -0.150787 0.427674 0.210024 -0.194824 -0.122131 -0.138222 -0.195695 0.220920 -0.009309 -0.011866 -0.009117
polarizability: 2.19206328e+02 5.14704306e+00 1.48071299e+02 9.63253415e-03 -1.77766394e-03 5.83507418e+01
1716.lowfreq: -3.9022 -0.0008 -0.0003 0.0004 11.7039 12.3905 91.0001 106.1143 148.0533
frequency: 90.9556 106.1078 148.0510 180.1401 188.1757 274.5719 322.4906 327.8302 401.4992 424.3939 486.7962 515.4682 515.8375 564.4963 590.3785 632.6797 646.3376 705.5585 731.8422 747.5124 759.5959 799.5114 819.6602 842.2648 870.2187 889.9151 952.0600 973.7216 978.1428 996.7605 997.1330 1024.2739 1047.8961 1073.5902 1138.1032 1159.0900 1174.1784 1182.0299 1228.8258 1252.5298 1276.2416 1364.7785 1396.7862 1399.1399 1425.6324 1441.3424 1446.3637 1455.2710 1460.8343 1532.9519 1548.3268 1588.2350 1590.3839 1644.1997 2994.4045 3072.3817 3121.1117 3129.3842 3134.3794 3137.4568 3151.2325 3165.4151 3177.0196
redmass: 2.6136 1.1911 5.8144 3.7514 3.6663 4.8461 3.6329 5.0684 6.0070 3.1028 6.9626 3.5137 4.7329 3.3148 5.5503 5.1562 6.1637 4.0817 6.7520 6.3270 1.2888 3.4475 1.4556 5.4367 5.9710 1.6447 1.3309 1.3993 7.9350 2.0933 1.3373 2.1982 1.4800 2.9193 1.3007 2.5438 1.1193 2.3958 1.7508 4.4102 1.7787 2.4381 2.8244 1.5074 3.1563 3.4534 2.6371 1.0442 1.1619 4.9573 6.5992 6.8174 7.6900 7.6082 1.0381 1.0977 1.0864 1.0984 1.0894 1.0891 1.0948 1.1001 1.0964
irintensity: 3.1337 0.0730 1.4430 2.3134 3.8995 0.2674 4.9647 0.3026 0.4073 5.6920 0.2411 2.9895 1.2269 6.3832 0.1785 1.7574 3.4767 12.7167 4.9598 7.1891 25.7608 10.2468 92.5341 27.6462 0.6947 2.4811 0.1068 4.0534 38.4890 0.9517 0.0971 3.2455 5.6042 3.2358 0.4296 34.2328 3.1194 8.3499 2.1162 32.1859 5.6211 32.0626 1.8847 7.2142 2.2169 8.5803 5.3600 18.1549 17.5598 4.4489 54.8394 14.0636 6.1258 9.6736 17.3425 10.2313 1.4376 4.1950 8.7274 10.0757 22.7857 25.0265 7.2348
temp: 298.150 k
press: 1.00000 atm
elementType: 8 7 6 6 6 6 6 6 6 6 6 6 6 6 1 1 1 1 1 1 1 1 1
symmnumber: 1
zpe: 463037.9 jmol-1
zpe.correction: 0.176362 hartree
zpe.thermalcorrener: 0.186813 hartree
zpe.thermalcorrenthalpy: 0.187757 hartree
zpe.thermalcorrgfe: 0.140282 hartree
zpe.sumelectzpe: -591.710036 hartree
zpe.sumelectthermal: -591.699584 hartree
zpe.sumelectthermalent: -591.698640 hartree
zpe.sumelectthermalfe: -591.746116 hartree
dipole: 0.2050 0.8436 0.0000
dipole: 0.8682
quadrupole: -64.1916 -74.5711 -84.9448
quadrupole: -2.4943 0.0013 -0.0004
quadrupole: 10.3775 -0.0019 -10.3756 -2.4943 0.0013 -0.0004
hfenergy: -591.8863976 hartree
pointgroup: C01 [X(C12H9N1O1)]
dipole: -0.0874511 -0.3301896 0.0000123 debye
dipolederiv: -0.8270067 0.0502933 0.0000307 0.1113424 -0.6115426 -0.0000151 0.0000409 -0.0000169 -0.1005795 -0.7167996 -0.0242864 0.0000234 -0.0274821 -0.323068 0.0000052 0.0000236 -0.0000014 -0.2344218 0.2074139 0.0911807 -0.0000106 0.193225 0.0036531 -0.0000107 -0.0000109 -0.0000043 0.0274908 0.2253236 -0.0984514 -0.0000117 -0.2771361 0.0158674 0.0000094 -0.0000045 0.0000081 0.0060879 0.0131299 0.0458587 0.0000019 0.1582394 -0.1248318 -0.0000132 0.000007 -0.0000048 0.0440379 0.5399801 -0.0978961 -0.0000186 0.133966 -0.0365965 -0.0000086 -0.0000135 0.0000003 0.0581407 -0.0279754 0.0396476 -0.0000055 0.0496338 0.1064688 0.0000048 -0.0000105 0.0000058 -0.1832468 -0.0942849 -0.0361261 -0.0000068 -0.1008754 0.1209827 0.0000134 -0.0000083 0.0000058 -0.162586 -0.1310026 -0.0701461 -0.0000017 -0.0842001 0.0435537 0.0000092 -0.0000037 0.0000071 -0.1473401 0.0370985 -0.0179103 -0.0000113 -0.1388096 0.0832427 0.0000124 -0.0000146 0.0000064 -0.1750073 0.810525 -0.0404531 -0.0000481 -0.0752463 0.7092715 0.0000175 -0.0001326 0.0000366 0.0583681 -0.0123643 0.047204 -0.0000076 -0.0058893 0.1390439 0.0000071 -0.000008 0.0000034 -0.1583472 0.1017167 -0.0489441 -0.000015 -0.0138253 -0.1083321 0.0000011 -0.0000113 0.000004 -0.1645766 -0.2334338 0.103891 0.0000129 -0.0109856 0.0062599 0.0000072 0.0001327 -0.0000318 0.061127 0.013045 0.1179006 0.0000108 0.04662 -0.0383176 -0.0000077 0.0000092 -0.0000119 0.160181 0.0601847 -0.0727292 0.0000049 -0.0452029 -0.027134 -0.0000022 0.0000064 -0.0000003 0.1793797 0.0654479 0.0848876 0.0000065 0.0371545 -0.0066283 -0.0000058 0.0000059 -0.0000083 0.1583448 0.0257991 0.0486 0.0000081 0.1209727 -0.0647206 -0.0000107 0.0000105 -0.0000072 0.1559105 0.0279449 -0.0905242 0.0000053 -0.1040476 -0.0810493 0.0000006 0.0000058 0.0000004 0.1588835 -0.1504747 -0.0125374 0.0000166 -0.0126361 0.0892215 -0.000001 0.0000135 -0.0000014 0.1625348 0.0915629 -0.046527 0.0000191 0.0374617 -0.0611755 0.0000487 -0.0000202 0.0000573 0.132381 -0.012912 0.0135085 -0.0597619 0.0038153 0.0828846 -0.0752413 -0.1172905 -0.043075 -0.0183208 -0.0129181 0.0135596 0.0597586 0.0039057 0.0829465 0.0751798 0.1172731 0.043028 -0.0184417 unknown
polarizability: 219.3875198|3.6837635|147.8901069|-0.009594|0.0019749|58.3507418 unknown
InChI: InChI=1S/C12H9NO/c1-8-13-12-10-5-3-2-4-9(10)6-7-11(12)14-8/h2-7H,1H3
charge 0 multiplicity 1
23 atoms
O  -2.673517 -0.814268 0.000228
N  -1.68456 1.277524 0.000218
C  0.752075 0.41295 0.000074
C  -0.672218 0.280231 0.000149
C  1.514581 -0.823918 0.000013
C  -1.269942 -0.996801 0.000155
C  0.842715 -2.102404 0.000016
C  -0.551732 -2.214531 0.000087
C  1.430642 1.669742 0.000064
C  2.9457 -0.738061 -0.000065
C  -2.832377 0.608749 0.000275
C  2.828643 1.713282 -0.000009
C  3.590703 0.502256 -0.00008
C  -4.2251 1.134963 0.000372
H  1.457108 -3.010101 -0.000042
H  -1.057984 -3.18318 0.000093
H  0.832398 2.586727 0.000116
H  3.531264 -1.665469 -0.000115
H  3.346755 2.67867 -0.000016
H  4.685309 0.550844 -0.000137
H  -4.188463 2.234535 0.000089
H  -4.781848 0.790944 -0.890079
H  -4.781553 0.791413 0.891194
