program: Orca
programVersion: 5.0.2
elementType: S P O O O O N N C C C C C C C C C C C C C C H H H H H H H H H H H H H H H H H
charge: 0
multiplicity: 1
keywords: wb97x-d3
keywords: def2-TZVPP
keywords: def2/J RIJCOSX
keywords: DEFGRID2
keywords: scfconv7
keywords: smallprint printgap noloewdin
keywords: NOSOSCF
formula: C14H17N2O4PS
InChI: InChI=1/C14H17N2O4PS/c1-3-18-21(22,19-4-2)20-13-10-11-14(17)16(15-13)12-8-6-5-7-9-12/h5-11H,3-4H2,1-2H3
39 atoms
S  1.012481 -1.442138 1.966004
P  1.95089 -0.17273 0.880524
O  1.396729 1.371151 0.905264
O  2.106615 -0.500237 -0.66638
O  3.41484 0.247282 1.32456
O  -3.582052 2.635612 -0.46059
N  -1.826526 1.181287 -0.420071
N  -0.58317 0.847935 -0.061154
C  -2.579879 0.093757 -0.953285
C  0.153905 1.72166 0.510642
C  -2.407385 2.412778 -0.190271
C  -0.258846 3.060301 0.758924
C  -1.512492 3.387635 0.399571
C  -3.275366 0.23081 -2.145791
C  -2.571867 -1.115088 -0.270623
C  1.307375 -1.469402 -1.382262
C  4.346785 -0.68275 1.91722
C  -3.979115 -0.853725 -2.648032
C  -3.270913 -2.195074 -0.786726
C  -3.982325 -2.065303 -1.971434
C  2.030659 -2.785788 -1.494682
C  4.860845 -1.70437 0.933947
H  0.417916 3.769488 1.216185
H  -1.90483 4.381813 0.563208
H  -3.254779 1.160734 -2.69517
H  -2.014838 -1.215765 0.652155
H  0.341639 -1.594329 -0.893828
H  1.132946 -1.026725 -2.361178
H  5.156494 -0.0560 2.286034
H  3.875399 -1.163579 2.776206
H  -4.519434 -0.750314 -3.579196
H  -3.262599 -3.136793 -0.255343
H  -4.531195 -2.90774 -2.370255
H  1.440112 -3.459464 -2.115588
H  3.008575 -2.671684 -1.961811
H  2.158627 -3.25564 -0.520041
H  5.658821 -2.27431 1.409548
H  4.089446 -2.412329 0.633032
H  5.273283 -1.233255 0.042504
elementType: S P O N C H
totalener: -1693.87524629 hartree
nucrepener: 2226.13955064 hartree
electener: -3920.01479693 hartree
oneelecener: -6750.88110200 hartree
twoeener: 2830.86630508 hartree
cpcmener: -0.03603619 hartree
kineticenergy: 1688.41762084 hartree
xcener: -126.695134053548 hartree
chargesum: -0.0000000
charge: -0.437763 0.759039 -0.318610 -0.345052 -0.345621 -0.558650 0.092019 -0.258330 0.178571 0.346588 0.376245 -0.152079 -0.146322 -0.221119 -0.234125 0.089884 0.031054 -0.127200 -0.111781 -0.161719 -0.270888 -0.251611 0.164830 0.154453 0.154508 0.142774 0.074123 0.112979 0.111711 0.095223 0.162409 0.160799 0.163203 0.106341 0.098936 0.080923 0.104022 0.086218 0.094019
qa: -0.4378 0.7590 -0.3186 -0.3451 -0.3456 -0.5586 0.0920 -0.2583 0.1786 0.3466 0.3762 -0.1521 -0.1463 -0.2211 -0.2341 0.0899 0.0311 -0.1272 -0.1118 -0.1617 -0.2709 -0.2516 0.1648 0.1545 0.1545 0.1428 0.0741 0.1130 0.1117 0.0952 0.1624 0.1608 0.1632 0.1063 0.0989 0.0809 0.1040 0.0862 0.0940
va: 1.9800 5.4853 2.1937 2.0803 2.1153 1.9451 3.2675 2.9322 3.5576 4.0185 4.1518 3.9362 3.9012 4.0131 3.9697 3.7931 3.8542 3.8942 3.8852 3.9067 3.9504 3.8937 0.9942 1.0000 1.0100 1.0260 1.0110 0.9938 0.9920 1.0102 0.9897 0.9903 0.9880 1.0108 1.0012 1.0074 1.0097 1.0035 1.0066
dispcorr: -0.020699409 hartree
energy: -1693.895945699315
dipole: 10.88107 -8.66133 2.21974 -16.27180 15.62282 -0.64898 -7.82719 7.20607 -0.62112
magnitude: 2.39462 au
magnitude: 6.08664 debye
