program: Orca
programVersion: 5.0.2
elementType: S P O O O O N N C C C C C C C C C C C C C C H H H H H H H H H H H H H H H H H
charge: 0
multiplicity: 1
keywords: wb97x-d3
keywords: def2-TZVPP
keywords: def2/J RIJCOSX
keywords: DEFGRID2
keywords: scfconv7
keywords: smallprint printgap noloewdin
keywords: NOSOSCF
formula: C14H17N2O4PS
InChI: InChI=1/C14H17N2O4PS/c1-3-18-21(22,19-4-2)20-13-10-11-14(17)16(15-13)12-8-6-5-7-9-12/h5-11H,3-4H2,1-2H3
39 atoms
S  1.14773 -2.094467 1.397954
P  2.035984 -0.713365 0.418873
O  1.521764 0.818742 0.724552
O  1.945844 -0.883558 -1.149152
O  3.58331 -0.485114 0.691069
O  -3.60334 2.233075 0.596254
N  -1.870157 0.923508 -0.096842
N  -0.589167 0.54319 -0.060768
C  -2.712982 0.053061 -0.850754
C  0.227652 1.206307 0.666958
C  -2.403627 1.9820 0.614094
C  -0.138506 2.356567 1.418877
C  -1.42856 2.732436 1.376468
C  -2.661504 -1.309996 -0.592083
C  -3.54994 0.558109 -1.835968
C  2.496597 0.060317 -2.103407
C  4.210533 -0.775359 1.959803
C  -3.461194 -2.173936 -1.324526
C  -4.35167 -0.314204 -2.557201
C  -4.312873 -1.67858 -2.302306
C  3.697288 -0.535261 -2.790359
C  3.817106 0.195199 3.045612
H  0.603248 2.891058 1.996736
H  -1.786355 3.589795 1.9296
H  -1.997279 -1.693879 0.171786
H  -3.568852 1.616339 -2.057071
H  1.694458 0.261073 -2.811924
H  2.750418 1.003423 -1.617682
H  3.974769 -1.801825 2.245343
H  5.27747 -0.719569 1.754551
H  -3.421005 -3.236181 -1.123839
H  -5.004574 0.076757 -3.326051
H  -4.941001 -2.354122 -2.86768
H  3.447648 -1.467941 -3.295569
H  4.056703 0.166264 -3.543491
H  4.511798 -0.721138 -2.091048
H  2.763758 0.108943 3.313527
H  4.400272 -0.030033 3.938788
H  4.024941 1.226234 2.760869
elementType: S P O N C H
totalener: -1693.87660424 hartree
nucrepener: 2203.62100767 hartree
electener: -3897.49761191 hartree
oneelecener: -6706.15786444 hartree
twoeener: 2808.66025253 hartree
cpcmener: -0.04189550 hartree
kineticenergy: 1688.39182663 hartree
xcener: -126.685609632160 hartree
chargesum: 0.0000000
charge: -0.423432 0.746585 -0.319514 -0.353760 -0.335618 -0.557972 0.079929 -0.246682 0.179707 0.361186 0.377031 -0.151621 -0.150735 -0.207551 -0.223544 0.042573 0.025094 -0.132378 -0.124435 -0.158704 -0.247568 -0.233787 0.164182 0.154645 0.142438 0.154497 0.106027 0.102998 0.096020 0.110451 0.161176 0.162555 0.162503 0.090342 0.094906 0.083221 0.077292 0.100152 0.091792
qa: -0.4234 0.7466 -0.3195 -0.3538 -0.3356 -0.5580 0.0799 -0.2467 0.1797 0.3612 0.3770 -0.1516 -0.1507 -0.2076 -0.2235 0.0426 0.0251 -0.1324 -0.1244 -0.1587 -0.2476 -0.2338 0.1642 0.1546 0.1424 0.1545 0.1060 0.1030 0.0960 0.1105 0.1612 0.1626 0.1625 0.0903 0.0949 0.0832 0.0773 0.1002 0.0918
va: 2.0134 5.4856 2.1173 2.1064 2.1051 1.9459 3.2657 2.8923 3.5950 3.9676 4.1573 3.9472 3.9125 4.0143 4.0109 3.8428 3.8577 3.9090 3.8908 3.9016 3.9501 3.8834 0.9933 1.0000 1.0222 1.0092 0.9949 0.9990 1.0098 0.9912 0.9904 0.9898 0.9884 1.0027 1.0068 1.0114 1.0198 1.0092 1.0059
dispcorr: -0.019285269 hartree
energy: -1693.895889509630
dipole: 13.46735 -10.49338 2.97397 0.35909 0.94688 1.30597 -4.80103 4.45268 -0.34835
magnitude: 3.26671 au
magnitude: 8.30332 debye
