program: Orca
programVersion: 5.0.2
elementType: S P O O O O N N C C C C C C C C C C C C C C H H H H H H H H H H H H H H H H H
charge: 0
multiplicity: 1
keywords: wb97x-d3
keywords: def2-TZVPP
keywords: def2/J RIJCOSX
keywords: DEFGRID2
keywords: scfconv7
keywords: smallprint printgap noloewdin
keywords: NOSOSCF
formula: C14H17N2O4PS
InChI: InChI=1/C14H17N2O4PS/c1-3-18-21(22,19-4-2)20-13-10-11-14(17)16(15-13)12-8-6-5-7-9-12/h5-11H,3-4H2,1-2H3
39 atoms
S  1.055845 -2.167464 1.415476
P  2.011775 -0.87557 0.376346
O  1.589144 0.689918 0.660999
O  1.878569 -1.084123 -1.18461
O  3.573481 -0.733341 0.610596
O  -3.430915 2.428774 0.423937
N  -1.794571 0.951765 -0.160996
N  -0.540788 0.492823 -0.09413
C  -2.694059 0.071181 -0.832781
C  0.325322 1.158797 0.571028
C  -2.250796 2.099298 0.459164
C  0.041897 2.391135 1.222412
C  -1.220893 2.846599 1.149657
C  -2.696932 -1.270414 -0.475054
C  -3.525503 0.538594 -1.841068
C  2.752374 -0.534985 -2.201545
C  4.219838 -1.022437 1.869336
C  -3.544702 -2.15022 -1.129977
C  -4.37579 -0.348939 -2.484119
C  -4.390703 -1.691219 -2.130118
C  2.737644 0.972215 -2.278245
C  3.937374 0.022191 2.919676
H  0.820856 2.923528 1.75115
H  -1.517754 3.769606 1.628225
H  -2.035325 -1.62682 0.304233
H  -3.502502 1.576736 -2.141641
H  3.762542 -0.913745 -2.044723
H  2.37584 -0.965171 -3.127151
H  3.915443 -2.014562 2.206318
H  5.280177 -1.058596 1.628381
H  -3.545301 -3.195648 -0.852174
H  -5.023578 0.012615 -3.271447
H  -5.055158 -2.378437 -2.63671
H  1.725096 1.362377 -2.381129
H  3.215192 1.44346 -1.420551
H  3.29773 1.26976 -3.165151
H  2.891297 0.024038 3.226718
H  4.537121 -0.201109 3.802272
H  4.205246 1.021162 2.576223
elementType: S P O N C H
totalener: -1693.87515285 hartree
nucrepener: 2218.68328971 hartree
electener: -3912.55844256 hartree
oneelecener: -6736.40220043 hartree
twoeener: 2823.84375787 hartree
cpcmener: -0.04176683 hartree
kineticenergy: 1688.39113979 hartree
xcener: -126.687756063553 hartree
chargesum: 0.0000000
charge: -0.426021 0.743223 -0.312216 -0.351686 -0.336434 -0.558347 0.075312 -0.238190 0.182945 0.344388 0.379414 -0.141101 -0.155726 -0.210526 -0.222771 0.037321 0.023364 -0.132495 -0.126125 -0.159902 -0.264943 -0.232115 0.164368 0.154064 0.144347 0.154093 0.100476 0.112011 0.096440 0.110670 0.160965 0.162596 0.163145 0.090112 0.091132 0.109217 0.076977 0.100187 0.091828
qa: -0.4260 0.7432 -0.3122 -0.3517 -0.3364 -0.5583 0.0753 -0.2382 0.1829 0.3444 0.3794 -0.1411 -0.1557 -0.2105 -0.2228 0.0373 0.0234 -0.1325 -0.1261 -0.1599 -0.2649 -0.2321 0.1644 0.1541 0.1443 0.1541 0.1005 0.1120 0.0964 0.1107 0.1610 0.1626 0.1631 0.0901 0.0911 0.1092 0.0770 0.1002 0.0918
va: 2.0181 5.4732 2.1120 2.1208 2.1006 1.9452 3.2663 2.8672 3.5999 3.9796 4.1550 3.9404 3.9120 4.0113 4.0122 3.8584 3.8590 3.9093 3.8929 3.9023 3.9142 3.8844 0.9932 1.0005 1.0220 1.0100 1.0003 0.9866 1.0097 0.9913 0.9905 0.9897 0.9882 1.0061 1.0122 1.0087 1.0198 1.0095 1.0057
dispcorr: -0.019895316 hartree
energy: -1693.895048162902
dipole: 12.24038 -8.97637 3.26401 2.63211 -1.65607 0.97604 -3.84436 3.38446 -0.45990
magnitude: 3.43772 au
magnitude: 8.73798 debye
