program: Orca
programVersion: 5.0.2
elementType: S P O O O O N N C C C C C C C C C C C C C C H H H H H H H H H H H H H H H H H
charge: 0
multiplicity: 1
keywords: wb97x-d3
keywords: def2-TZVPP
keywords: def2/J RIJCOSX
keywords: DEFGRID2
keywords: scfconv7
keywords: smallprint printgap noloewdin
keywords: NOSOSCF
formula: C14H17N2O4PS
InChI: InChI=1/C14H17N2O4PS/c1-3-18-21(22,19-4-2)20-13-10-11-14(17)16(15-13)12-8-6-5-7-9-12/h5-11H,3-4H2,1-2H3
39 atoms
S  1.017578 -1.797419 2.22354
P  1.97137 -0.586501 1.092069
O  1.519914 0.99318 1.210602
O  1.976865 -0.857179 -0.47374
O  3.493178 -0.419272 1.488807
O  -3.341902 2.650953 -0.175015
N  -1.68774 1.084656 -0.159976
N  -0.47779 0.652287 0.204346
C  -2.462971 0.100095 -0.843056
C  0.298591 1.440218 0.844676
C  -2.199557 2.331166 0.134958
C  -0.048899 2.775084 1.191809
C  -1.274187 3.198882 0.83427
C  -2.591298 -1.157578 -0.269962
C  -3.026545 0.37755 -2.080232
C  1.129806 -1.824433 -1.137145
C  4.443854 0.377564 0.734902
C  -3.287841 -2.148147 -0.944817
C  -3.728408 -0.618574 -2.743261
C  -3.861169 -1.880415 -2.179951
C  0.73347 -1.287327 -2.486153
C  5.396656 -0.52075 -0.008083
H  0.651332 3.406788 1.721421
H  -1.616529 4.196876 1.070215
H  -2.139545 -1.367466 0.690785
H  -2.902662 1.348011 -2.540422
H  1.701274 -2.747793 -1.232336
H  0.251556 -2.031271 -0.526754
H  3.932508 1.057934 0.052613
H  4.965653 0.983803 1.473331
H  -3.383488 -3.129391 -0.50001
H  -4.164047 -0.407192 -3.710461
H  -4.405225 -2.65421 -2.704702
H  1.601923 -1.078682 -3.110875
H  0.12914 -2.037409 -2.99691
H  0.136877 -0.379897 -2.400383
H  6.137274 0.093991 -0.519519
H  5.927815 -1.187444 0.670294
H  4.883019 -1.120424 -0.758679
elementType: S P O N C H
totalener: -1693.87601296 hartree
nucrepener: 2238.68627021 hartree
electener: -3932.56228317 hartree
oneelecener: -6775.64055720 hartree
twoeener: 2843.07827403 hartree
cpcmener: -0.03941713 hartree
kineticenergy: 1688.39462818 hartree
xcener: -126.688591408295 hartree
chargesum: 0.0000000
charge: -0.427568 0.730599 -0.314331 -0.333329 -0.357371 -0.561398 0.121779 -0.257740 0.153607 0.351508 0.378595 -0.147835 -0.150262 -0.248372 -0.226606 0.058676 0.050299 -0.096971 -0.111829 -0.165442 -0.267659 -0.245908 0.164453 0.154473 0.138003 0.152289 0.124543 0.090334 0.098652 0.106927 0.160830 0.162724 0.162561 0.103442 0.095850 0.085816 0.094592 0.089595 0.082477
qa: -0.4276 0.7306 -0.3143 -0.3333 -0.3574 -0.5614 0.1218 -0.2577 0.1536 0.3515 0.3786 -0.1478 -0.1503 -0.2484 -0.2266 0.0587 0.0503 -0.0970 -0.1118 -0.1654 -0.2677 -0.2459 0.1645 0.1545 0.1380 0.1523 0.1245 0.0903 0.0987 0.1069 0.1608 0.1627 0.1626 0.1034 0.0958 0.0858 0.0946 0.0896 0.0825
va: 2.0086 5.4986 2.1485 2.0585 2.1237 1.9428 3.2391 2.9349 3.5158 4.0173 4.1509 3.9344 3.8995 3.9826 3.9959 3.7649 3.8427 3.8694 3.8770 3.9101 3.9510 3.9373 0.9944 1.0000 1.0275 1.0128 1.0003 1.0169 0.9999 0.9940 0.9897 0.9894 0.9885 1.0056 1.0062 1.0021 1.0075 1.0034 1.0105
dispcorr: -0.021593560 hartree
energy: -1693.897606518951
dipole: 8.89446 -6.70095 2.19351 -5.69899 6.20096 0.50197 -16.07552 14.46239 -1.61313
magnitude: 2.76869 au
magnitude: 7.03745 debye
