program: Orca
programVersion: 5.0.2
elementType: S P O O O O N N C C C C C C C C C C C C C C H H H H H H H H H H H H H H H H H
charge: 0
multiplicity: 1
keywords: wb97x-d3
keywords: def2-TZVPP
keywords: def2/J RIJCOSX
keywords: DEFGRID2
keywords: scfconv7
keywords: smallprint printgap noloewdin
keywords: NOSOSCF
formula: C14H17N2O4PS
InChI: InChI=1/C14H17N2O4PS/c1-3-18-21(22,19-4-2)20-13-10-11-14(17)16(15-13)12-8-6-5-7-9-12/h5-11H,3-4H2,1-2H3
39 atoms
S  1.116298 -1.593206 2.023432
P  2.010867 -0.319622 0.905231
O  1.516107 1.239106 1.041727
O  2.022221 -0.587577 -0.660934
O  3.52546 0.019864 1.238626
O  -3.511715 2.594708 -0.046691
N  -1.749723 1.15744 -0.181557
N  -0.498358 0.798955 0.112353
C  -2.490942 0.142914 -0.857478
C  0.255157 1.62089 0.736512
C  -2.330679 2.355517 0.179842
C  -0.157979 2.924374 1.12718
C  -1.425908 3.272302 0.843115
C  -2.513567 -1.135568 -0.317849
C  -3.129018 0.419909 -2.05792
C  1.195353 -1.564162 -1.332735
C  4.446577 -0.989685 1.705451
C  -3.183292 -2.147544 -0.988476
C  -3.803303 -0.597803 -2.716257
C  -3.834385 -1.880026 -2.184716
C  0.731362 -0.99634 -2.647909
C  4.804723 -1.990787 0.635308
H  0.5273 3.592198 1.631509
H  -1.81875 4.241622 1.116891
H  -2.000574 -1.343167 0.612511
H  -3.083462 1.408635 -2.493454
H  1.804792 -2.456249 -1.481023
H  0.347961 -1.835622 -0.703981
H  5.323417 -0.430535 2.025487
H  4.023386 -1.482786 2.582423
H  -3.19779 -3.14502 -0.570248
H  -4.298978 -0.386295 -3.65415
H  -4.360777 -2.669577 -2.704102
H  0.109612 -0.112555 -2.508718
H  1.568785 -0.736271 -3.295463
H  0.133271 -1.748216 -3.163201
H  5.17989 -1.501006 -0.262854
H  5.592737 -2.641397 1.01496
H  3.96091 -2.625874 0.362936
elementType: S P O N C H
totalener: -1693.87568259 hartree
nucrepener: 2243.13580807 hartree
electener: -3937.01149066 hartree
oneelecener: -6784.82118978 hartree
twoeener: 2847.80969912 hartree
cpcmener: -0.03682127 hartree
kineticenergy: 1688.40636903 hartree
xcener: -126.692399014922 hartree
chargesum: 0.0000000
charge: -0.440207 0.763696 -0.320144 -0.345677 -0.348553 -0.560665 0.122588 -0.259207 0.146168 0.342718 0.379290 -0.151584 -0.147863 -0.249239 -0.221273 0.073758 0.028962 -0.099977 -0.113981 -0.162770 -0.270184 -0.240064 0.164966 0.154605 0.140256 0.153342 0.120880 0.089109 0.111789 0.095718 0.160985 0.162566 0.162429 0.085744 0.103345 0.095810 0.092860 0.101018 0.078785
qa: -0.4402 0.7637 -0.3201 -0.3457 -0.3486 -0.5607 0.1226 -0.2592 0.1462 0.3427 0.3793 -0.1516 -0.1479 -0.2492 -0.2213 0.0738 0.0290 -0.1000 -0.1140 -0.1628 -0.2702 -0.2401 0.1650 0.1546 0.1403 0.1533 0.1209 0.0891 0.1118 0.0957 0.1610 0.1626 0.1624 0.0857 0.1033 0.0958 0.0929 0.1010 0.0788
va: 1.9807 5.4799 2.1876 2.0733 2.1144 1.9437 3.2362 2.9349 3.5205 4.0257 4.1489 3.9383 3.9000 3.9799 3.9952 3.7563 3.8595 3.8741 3.8786 3.9080 3.9564 3.8913 0.9942 0.9999 1.0276 1.0114 0.9956 1.0164 0.9919 1.0110 0.9897 0.9895 0.9886 1.0028 1.0063 1.0054 1.0064 1.0080 1.0130
dispcorr: -0.021672742 hartree
energy: -1693.897355331682
dipole: 7.59604 -5.49319 2.10285 -12.53047 11.88711 -0.64335 -12.10911 11.27407 -0.83504
magnitude: 2.35227 au
magnitude: 5.97899 debye
