program: Orca
programVersion: 5.0.2
elementType: S P O O O O N N C C C C C C C C C C C C C C H H H H H H H H H H H H H H H H H
charge: 0
multiplicity: 1
keywords: wb97x-d3
keywords: def2-TZVPP
keywords: def2/J RIJCOSX
keywords: DEFGRID2
keywords: scfconv7
keywords: smallprint printgap noloewdin
keywords: NOSOSCF
formula: C14H17N2O4PS
InChI: InChI=1/C14H17N2O4PS/c1-3-18-21(22,19-4-2)20-13-10-11-14(17)16(15-13)12-8-6-5-7-9-12/h5-11H,3-4H2,1-2H3
39 atoms
S  1.837709 -0.68273 -1.893288
P  2.240563 -0.25135 -0.068101
O  1.650666 1.201518 0.435203
O  3.750729 -0.062973 0.372651
O  1.787922 -1.281457 1.047222
O  -3.520303 2.327349 -0.120535
N  -1.803344 0.849784 0.126283
N  -0.505796 0.564152 0.246159
C  -2.62674 -0.304291 -0.037708
C  0.340806 1.518756 0.322377
C  -2.323546 2.126624 0.053091
C  -0.022652 2.892739 0.308813
C  -1.332532 3.175126 0.185059
C  -3.742466 -0.503301 0.762563
C  -2.255356 -1.246588 -0.98727
C  4.604649 1.043959 0.000325
C  0.855081 -2.365378 0.838129
C  -4.495543 -1.657138 0.598065
C  -3.008792 -2.400259 -1.136033
C  -4.133031 -2.605832 -0.348193
C  5.011561 1.025641 -1.451801
C  -0.095406 -2.435893 2.004015
H  0.731102 3.663939 0.392897
H  -1.687968 4.1957 0.155525
H  -4.014654 0.216111 1.522173
H  -1.377402 -1.084528 -1.599595
H  4.117448 1.983812 0.262282
H  5.475996 0.933469 0.642717
H  0.315353 -2.221657 -0.097256
H  1.440961 -3.280468 0.752189
H  -5.364257 -1.817356 1.222306
H  -2.716703 -3.135434 -1.873815
H  -4.722862 -3.504687 -0.468163
H  5.463377 0.07375 -1.729875
H  4.175322 1.223337 -2.119663
H  5.755894 1.807045 -1.607855
H  0.429611 -2.587199 2.947152
H  -0.705629 -1.537028 2.082764
H  -0.765773 -3.283247 1.858112
elementType: S P O N C H
totalener: -1693.87301885 hartree
nucrepener: 2243.47098144 hartree
electener: -3937.34400030 hartree
oneelecener: -6785.43627941 hartree
twoeener: 2848.09227911 hartree
cpcmener: -0.03714002 hartree
kineticenergy: 1688.39904775 hartree
xcener: -126.692368294592 hartree
chargesum: -0.0000000
charge: -0.441394 0.760748 -0.318698 -0.351342 -0.347229 -0.560009 0.123304 -0.253171 0.149887 0.336702 0.379500 -0.144778 -0.150749 -0.216910 -0.243220 0.044502 0.070117 -0.120454 -0.110925 -0.158920 -0.252543 -0.273214 0.165218 0.154206 0.153337 0.142930 0.105378 0.108548 0.083998 0.121453 0.162360 0.160394 0.163095 0.089179 0.081463 0.101151 0.103046 0.087708 0.095332
qa: -0.4414 0.7607 -0.3187 -0.3513 -0.3472 -0.5600 0.1233 -0.2532 0.1499 0.3367 0.3795 -0.1448 -0.1507 -0.2169 -0.2432 0.0445 0.0701 -0.1205 -0.1109 -0.1589 -0.2525 -0.2732 0.1652 0.1542 0.1533 0.1429 0.1054 0.1085 0.0840 0.1215 0.1624 0.1604 0.1631 0.0892 0.0815 0.1012 0.1030 0.0877 0.0953
va: 1.9752 5.4893 2.1456 2.1373 2.1053 1.9444 3.2361 2.9388 3.5352 4.0426 4.1472 3.9320 3.9015 4.0033 3.9694 3.8484 3.7715 3.8870 3.8866 3.9046 3.9121 3.9470 0.9934 1.0003 1.0122 1.0292 0.9986 0.9869 1.0189 0.9987 0.9897 0.9904 0.9880 1.0060 1.0170 1.0095 1.0067 1.0035 1.0059
dispcorr: -0.021531031 hartree
energy: -1693.894549881928
dipole: 4.02299 -2.37122 1.65177 -7.36763 7.59934 0.23171 2.96727 -1.89876 1.06851
magnitude: 1.98084 au
magnitude: 5.03491 debye
