program: Orca
programVersion: 5.0.2
elementType: S P O O O O N N C C C C C C C C C C C C C C H H H H H H H H H H H H H H H H H
charge: 0
multiplicity: 1
keywords: wb97x-d3
keywords: def2-TZVPP
keywords: def2/J RIJCOSX
keywords: DEFGRID2
keywords: scfconv7
keywords: smallprint printgap noloewdin
keywords: NOSOSCF
formula: C14H17N2O4PS
InChI: InChI=1/C14H17N2O4PS/c1-3-18-21(22,19-4-2)20-13-10-11-14(17)16(15-13)12-8-6-5-7-9-12/h5-11H,3-4H2,1-2H3
39 atoms
S  1.193934 -1.586155 1.741703
P  1.984361 -0.227285 0.64789
O  1.370655 1.282005 0.835862
O  1.930317 -0.371797 -0.930375
O  3.515463 0.109673 0.894654
O  -3.703199 2.513375 -0.195998
N  -1.957981 1.048616 -0.200161
N  -0.679419 0.734526 0.02627
C  -2.687831 0.039826 -0.897735
C  0.071378 1.589455 0.610585
C  -2.541813 2.261906 0.105348
C  -0.37808 2.867826 1.041731
C  -1.660436 3.184166 0.790083
C  -2.175937 -0.452663 -2.089962
C  -3.870767 -0.459539 -0.37176
C  1.737561 -1.637524 -1.595058
C  4.160895 -0.062621 2.177092
C  -2.859313 -1.453722 -2.763512
C  -4.550497 -1.45539 -1.05709
C  -4.049536 -1.952468 -2.252481
C  2.993423 -2.47275 -1.585332
C  4.914226 -1.367587 2.215699
H  0.297797 3.545774 1.545187
H  -2.073114 4.140946 1.077951
H  -1.250068 -0.059648 -2.489682
H  -4.253372 -0.093569 0.571189
H  0.902986 -2.166749 -1.132383
H  1.447209 -1.375496 -2.610616
H  4.83251 0.787799 2.280002
H  3.427465 -0.007507 2.982719
H  -2.461848 -1.838348 -3.692803
H  -5.471979 -1.848136 -0.648618
H  -4.58396 -2.7297 -2.782445
H  2.822763 -3.377329 -2.169288
H  3.831538 -1.938235 -2.031761
H  3.272081 -2.778541 -0.576072
H  5.441724 -1.447825 3.16653
H  4.240287 -2.219767 2.132414
H  5.653726 -1.424625 1.417057
elementType: S P O N C H
totalener: -1693.87596105 hartree
nucrepener: 2206.12631727 hartree
electener: -3900.00227833 hartree
oneelecener: -6711.25879038 hartree
twoeener: 2811.25651206 hartree
cpcmener: -0.03966838 hartree
kineticenergy: 1688.40786815 hartree
xcener: -126.690238062040 hartree
chargesum: 0.0000000
charge: -0.437593 0.775941 -0.320627 -0.346852 -0.351891 -0.560208 0.079480 -0.246268 0.183480 0.331456 0.375494 -0.148407 -0.145640 -0.231877 -0.224168 0.042402 0.052889 -0.116642 -0.122546 -0.160253 -0.235099 -0.246090 0.164020 0.154577 0.152309 0.155518 0.092916 0.110479 0.108553 0.089198 0.160913 0.162088 0.163388 0.099488 0.093643 0.075921 0.100425 0.077682 0.091900
qa: -0.4376 0.7759 -0.3206 -0.3469 -0.3519 -0.5602 0.0795 -0.2463 0.1835 0.3315 0.3755 -0.1484 -0.1456 -0.2319 -0.2242 0.0424 0.0529 -0.1166 -0.1225 -0.1603 -0.2351 -0.2461 0.1640 0.1546 0.1523 0.1555 0.0929 0.1105 0.1086 0.0892 0.1609 0.1621 0.1634 0.0995 0.0936 0.0759 0.1004 0.0777 0.0919
va: 1.9803 5.4704 2.1916 2.0896 2.1029 1.9442 3.2520 2.9104 3.5823 4.0279 4.1606 3.9343 3.9022 4.0077 4.0107 3.8337 3.8359 3.8886 3.8895 3.9024 3.9387 3.9148 0.9952 0.9996 1.0087 1.0077 1.0092 0.9901 0.9967 1.0124 0.9906 0.9898 0.9881 1.0089 1.0056 1.0107 1.0096 1.0159 1.0026
dispcorr: -0.019455724 hartree
energy: -1693.895416777797
dipole: 13.39758 -11.05309 2.34449 -13.25678 12.94012 -0.31666 -3.93216 3.92911 -0.00305
magnitude: 2.36578 au
magnitude: 6.01334 debye
