program: Orca
programVersion: 5.0.2
elementType: S P O O O O N N C C C C C C C C C C C C C C H H H H H H H H H H H H H H H H H
charge: 0
multiplicity: 1
keywords: wb97x-d3
keywords: def2-TZVPP
keywords: def2/J RIJCOSX
keywords: DEFGRID2
keywords: scfconv7
keywords: smallprint printgap noloewdin
keywords: NOSOSCF
formula: C14H17N2O4PS
InChI: InChI=1/C14H17N2O4PS/c1-3-18-21(22,19-4-2)20-13-10-11-14(17)16(15-13)12-8-6-5-7-9-12/h5-11H,3-4H2,1-2H3
39 atoms
S  1.362414 -2.153515 1.309354
P  2.164088 -0.606847 0.513326
O  1.591735 0.8398 1.044106
O  2.116878 -0.439025 -1.060727
O  3.704394 -0.353068 0.79731
O  -3.52036 2.227727 0.545185
N  -1.728275 0.940826 -0.027473
N  -0.453163 0.566335 0.110132
C  -2.47745 0.108083 -0.911095
C  0.301126 1.217671 0.910904
C  -2.326401 1.974737 0.664209
C  -0.136571 2.339649 1.667713
C  -1.424731 2.702072 1.533519
C  -2.41839 -1.267799 -0.735671
C  -3.211182 0.661167 -1.951046
C  1.497482 -1.382873 -1.96603
C  4.346621 -0.727115 2.035603
C  -3.107222 -2.096907 -1.607669
C  -3.902201 -0.17752 -2.81319
C  -3.854532 -1.554477 -2.644137
C  0.820197 -0.629688 -3.079528
C  3.924178 0.129261 3.20354
H  0.548831 2.865955 2.318151
H  -1.834754 3.53882 2.081865
H  -1.832501 -1.689816 0.070679
H  -3.233181 1.730821 -2.106573
H  2.286079 -2.030563 -2.349844
H  0.783423 -2.003845 -1.424028
H  4.153968 -1.782975 2.232578
H  5.409554 -0.611149 1.834316
H  -3.060829 -3.168942 -1.471105
H  -4.472723 0.250796 -3.626323
H  -4.393799 -2.202842 -3.321731
H  0.408598 -1.350936 -3.785998
H  -0.001672 -0.01616 -2.711298
H  1.518454 0.006017 -3.623886
H  4.539576 -0.132361 4.06438
H  4.068873 1.189837 2.999971
H  2.883908 -0.03722 3.484252
elementType: S P O N C H
totalener: -1693.87586130 hartree
nucrepener: 2236.02571317 hartree
electener: -3929.90157447 hartree
oneelecener: -6770.74562768 hartree
twoeener: 2840.84405321 hartree
cpcmener: -0.03639970 hartree
kineticenergy: 1688.40018170 hartree
xcener: -126.690492742848 hartree
chargesum: -0.0000000
charge: -0.441199 0.775818 -0.314031 -0.350826 -0.352105 -0.560197 0.116120 -0.252056 0.139976 0.342966 0.376994 -0.149030 -0.148828 -0.224899 -0.216019 0.043934 0.026554 -0.114623 -0.119631 -0.158036 -0.252264 -0.236599 0.164361 0.154505 0.139612 0.152611 0.123951 0.092178 0.096058 0.111018 0.160810 0.162740 0.162709 0.095907 0.080385 0.099647 0.101014 0.091098 0.079374
qa: -0.4412 0.7758 -0.3140 -0.3508 -0.3521 -0.5602 0.1161 -0.2521 0.1400 0.3430 0.3770 -0.1490 -0.1488 -0.2249 -0.2160 0.0439 0.0266 -0.1146 -0.1196 -0.1580 -0.2523 -0.2366 0.1644 0.1545 0.1396 0.1526 0.1240 0.0922 0.0961 0.1110 0.1608 0.1627 0.1627 0.0959 0.0804 0.0996 0.1010 0.0911 0.0794
va: 1.9822 5.4715 2.1611 2.1031 2.1232 1.9441 3.2470 2.9395 3.5458 4.0344 4.1514 3.9323 3.9009 3.9734 3.9918 3.8031 3.8636 3.8848 3.8891 3.9023 3.9483 3.8802 0.9939 1.0000 1.0260 1.0125 0.9966 1.0119 1.0087 0.9916 0.9900 0.9896 0.9881 1.0064 1.0031 1.0064 1.0084 1.0068 1.0183
dispcorr: -0.021011357 hartree
energy: -1693.896872655363
dipole: 5.07525 -3.10633 1.96891 -3.56357 3.63379 0.07022 -5.76934 5.61379 -0.15554
magnitude: 1.97630 au
magnitude: 5.02334 debye
