program: Orca
programVersion: 5.0.2
elementType: S P O O O O N N C C C C C C C C C C C C C C H H H H H H H H H H H H H H H H H
charge: 0
multiplicity: 1
keywords: wb97x-d3
keywords: def2-TZVPP
keywords: def2/J RIJCOSX
keywords: DEFGRID2
keywords: scfconv7
keywords: smallprint printgap noloewdin
keywords: NOSOSCF
formula: C14H17N2O4PS
InChI: InChI=1/C14H17N2O4PS/c1-3-18-21(22,19-4-2)20-13-10-11-14(17)16(15-13)12-8-6-5-7-9-12/h5-11H,3-4H2,1-2H3
39 atoms
S  4.228795 0.600942 -0.116692
P  2.354402 0.23269 0.000902
O  1.503009 1.523458 -0.521436
O  1.718736 0.010107 1.43585
O  1.820642 -1.021581 -0.816263
O  -3.770838 2.190358 -0.221809
N  -1.921675 0.85735 -0.211767
N  -0.598602 0.672452 -0.259027
C  -2.662462 -0.314604 0.129001
C  0.154302 1.679654 -0.487607
C  -2.558151 2.073999 -0.358234
C  -0.336548 2.994101 -0.725944
C  -1.667662 3.172098 -0.667257
C  -3.707103 -0.741868 -0.677997
C  -2.302702 -1.028728 1.263565
C  2.359333 -0.783203 2.46101
C  2.232304 -1.310521 -2.170077
C  -4.405057 -1.889988 -0.333417
C  -3.00112 -2.180614 1.594283
C  -4.056721 -2.609648 0.801734
C  2.216755 -2.26407 2.215338
C  2.058172 -2.786292 -2.411419
H  0.346197 3.804991 -0.93982
H  -2.115211 4.14368 -0.824445
H  -3.968577 -0.199589 -1.576392
H  -1.480468 -0.692245 1.881996
H  3.408359 -0.491341 2.537618
H  1.860674 -0.490755 3.38273
H  1.615241 -0.72018 -2.849119
H  3.273774 -1.01383 -2.308028
H  -5.219626 -2.225593 -0.961074
H  -2.720974 -2.738341 2.47785
H  -4.603041 -3.505624 1.064838
H  2.597789 -2.799022 3.085505
H  1.173326 -2.548371 2.079076
H  2.788451 -2.597096 1.34926
H  2.35553 -3.015859 -3.434389
H  2.683667 -3.374415 -1.739797
H  1.020771 -3.09661 -2.287584
elementType: S P O N C H
totalener: -1693.87584482 hartree
nucrepener: 2208.64538445 hartree
electener: -3902.52122927 hartree
oneelecener: -6715.86333846 hartree
twoeener: 2813.34210919 hartree
cpcmener: -0.04099556 hartree
kineticenergy: 1688.38198004 hartree
xcener: -126.683366493560 hartree
chargesum: 0.0000000
charge: -0.424853 0.708382 -0.312287 -0.329155 -0.320479 -0.558848 0.081017 -0.248362 0.176668 0.337396 0.379505 -0.149049 -0.150723 -0.225135 -0.213348 0.026088 0.047313 -0.123952 -0.128088 -0.158362 -0.234353 -0.244397 0.163964 0.154555 0.156271 0.150074 0.098592 0.112102 0.109939 0.091829 0.162685 0.161526 0.163167 0.101573 0.090286 0.077833 0.092133 0.087185 0.091309
qa: -0.4249 0.7084 -0.3123 -0.3292 -0.3205 -0.5588 0.0810 -0.2484 0.1767 0.3374 0.3795 -0.1490 -0.1507 -0.2251 -0.2133 0.0261 0.0473 -0.1240 -0.1281 -0.1584 -0.2344 -0.2444 0.1640 0.1546 0.1563 0.1501 0.0986 0.1121 0.1099 0.0918 0.1627 0.1615 0.1632 0.1016 0.0903 0.0778 0.0921 0.0872 0.0913
va: 2.0402 5.5189 2.1743 2.0919 2.0653 1.9448 3.2676 2.8809 3.5983 4.0125 4.1535 3.9385 3.9095 4.0107 4.0175 3.8459 3.8213 3.8919 3.9003 3.9031 3.9063 3.9468 0.9948 0.9999 1.0077 1.0140 1.0116 0.9910 0.9902 1.0126 0.9897 0.9906 0.9883 1.0095 1.0034 1.0141 1.0077 1.0045 1.0036
dispcorr: -0.019120193 hartree
energy: -1693.894965017429
dipole: 0.24056 0.37060 0.61116 -20.29158 19.05971 -1.23187 1.04417 -1.27687 -0.23270
magnitude: 1.39469 au
magnitude: 3.54502 debye
