program: Orca
programVersion: 5.0.2
elementType: S P O O O O N N C C C C C C C C C C C C C C H H H H H H H H H H H H H H H H H
charge: 0
multiplicity: 1
keywords: wb97x-d3
keywords: def2-TZVPP
keywords: def2/J RIJCOSX
keywords: DEFGRID2
keywords: scfconv7
keywords: smallprint printgap noloewdin
keywords: NOSOSCF
formula: C14H17N2O4PS
InChI: InChI=1/C14H17N2O4PS/c1-3-18-21(22,19-4-2)20-13-10-11-14(17)16(15-13)12-8-6-5-7-9-12/h5-11H,3-4H2,1-2H3
39 atoms
S  4.245216 0.077586 -0.526126
P  2.356509 -0.104015 -0.273094
O  1.617108 1.305276 -0.628006
O  1.869184 -0.531125 1.177883
O  1.557998 -1.09494 -1.220461
O  -3.629958 2.209923 -0.69501
N  -1.830148 0.928639 -0.124504
N  -0.518223 0.674337 -0.124781
C  -2.627788 -0.155655 0.349839
C  0.281902 1.552274 -0.595565
C  -2.413372 2.070138 -0.640945
C  -0.141123 2.814151 -1.098383
C  -1.463192 3.057036 -1.108393
C  -2.376639 -1.43137 -0.138305
C  -3.614602 0.056105 1.303226
C  2.558195 -0.134202 2.383416
C  1.789796 -2.52204 -1.173494
C  -3.127274 -2.500764 0.325949
C  -4.365801 -1.019649 1.753376
C  -4.128504 -2.297372 1.265456
C  2.422955 1.341419 2.666964
C  1.138321 -3.144069 -2.379101
H  0.582074 3.533445 -1.457955
H  -1.863344 3.987147 -1.487166
H  -1.597923 -1.59214 -0.873093
H  -3.790088 1.041926 1.710735
H  2.095178 -0.726465 3.169991
H  3.606441 -0.428503 2.309447
H  2.864602 -2.716513 -1.166838
H  1.363579 -2.917222 -0.25063
H  -2.9304 -3.494088 -0.054514
H  -5.134294 -0.855258 2.496683
H  -4.716751 -3.132399 1.6220
H  2.952064 1.952545 1.935361
H  1.378607 1.651536 2.69525
H  2.859769 1.551377 3.643397
H  0.064116 -2.957561 -2.39492
H  1.574232 -2.775059 -3.306999
H  1.28836 -4.222886 -2.343198
elementType: S P O N C H
totalener: -1693.87621780 hartree
nucrepener: 2218.41444169 hartree
electener: -3912.29065949 hartree
oneelecener: -6735.21463745 hartree
twoeener: 2822.92397796 hartree
cpcmener: -0.04039681 hartree
kineticenergy: 1688.38356164 hartree
xcener: -126.684159641730 hartree
chargesum: 0.0000000
charge: -0.421989 0.702142 -0.307760 -0.325971 -0.332191 -0.556971 0.080939 -0.239032 0.171165 0.344012 0.378214 -0.159235 -0.148247 -0.197912 -0.215050 0.035412 0.023729 -0.144718 -0.131812 -0.152670 -0.243998 -0.243555 0.163547 0.154112 0.149493 0.154098 0.111938 0.097551 0.103788 0.112857 0.160432 0.162517 0.163528 0.082690 0.090830 0.106349 0.089888 0.089793 0.092088
qa: -0.4220 0.7021 -0.3078 -0.3260 -0.3322 -0.5570 0.0809 -0.2390 0.1712 0.3440 0.3782 -0.1592 -0.1482 -0.1979 -0.2151 0.0354 0.0237 -0.1447 -0.1318 -0.1527 -0.2440 -0.2436 0.1635 0.1541 0.1495 0.1541 0.1119 0.0976 0.1038 0.1129 0.1604 0.1625 0.1635 0.0827 0.0908 0.1063 0.0899 0.0898 0.0921
va: 2.0409 5.5252 2.1621 2.0616 2.1007 1.9463 3.2739 2.8696 3.6274 3.9914 4.1547 3.9474 3.9081 3.9903 3.9972 3.8422 3.8291 3.9155 3.8993 3.8991 3.8980 3.9636 0.9961 1.0001 1.0121 1.0105 0.9920 1.0117 1.0050 0.9942 0.9907 0.9899 0.9877 1.0177 1.0068 1.0096 1.0007 1.0045 1.0064
dispcorr: -0.019655261 hartree
energy: -1693.895873060657
dipole: -1.94697 2.42717 0.48020 -11.75479 10.84555 -0.90924 6.51453 -5.45342 1.06112
magnitude: 1.47759 au
magnitude: 3.75574 debye
