program: Orca
programVersion: 5.0.2
elementType: S P O O O O N N C C C C C C C C C C C C C C H H H H H H H H H H H H H H H H H
charge: 0
multiplicity: 1
keywords: wb97x-d3
keywords: def2-TZVPP
keywords: def2/J RIJCOSX
keywords: DEFGRID2
keywords: scfconv7
keywords: smallprint printgap noloewdin
keywords: NOSOSCF
formula: C14H17N2O4PS
InChI: InChI=1/C14H17N2O4PS/c1-3-18-21(22,19-4-2)20-13-10-11-14(17)16(15-13)12-8-6-5-7-9-12/h5-11H,3-4H2,1-2H3
39 atoms
S  1.233418 -1.572566 1.504544
P  2.035084 -0.157672 0.4900
O  1.429794 1.342193 0.78208
O  1.983859 -0.2164 -1.093478
O  3.567441 0.157997 0.748782
O  -3.79882 2.27313 0.423754
N  -1.931071 1.091881 -0.133452
N  -0.623018 0.843206 -0.039136
C  -2.65508 0.095626 -0.855446
C  0.107932 1.61834 0.668063
C  -2.582741 2.133317 0.495967
C  -0.388588 2.763664 1.348068
C  -1.707808 3.007793 1.248223
C  -2.478584 -1.235945 -0.504993
C  -3.490985 0.450206 -1.903596
C  1.541741 -1.377134 -1.832005
C  4.238436 -0.169894 1.989366
C  -3.151533 -2.221543 -1.210617
C  -4.165951 -0.543472 -2.597525
C  -4.001306 -1.877928 -2.252901
C  2.644228 -2.392873 -1.978457
C  4.993883 -1.465586 1.852477
H  0.275558 3.397321 1.919992
H  -2.163233 3.851191 1.747947
H  -1.815477 -1.503505 0.307923
H  -3.603744 1.484821 -2.195387
H  0.664648 -1.807636 -1.346423
H  1.231195 -0.98778 -2.799574
H  4.909999 0.664073 2.183516
H  3.519274 -0.217301 2.808314
H  -3.013347 -3.259249 -0.938813
H  -4.816837 -0.270064 -3.41681
H  -4.529111 -2.647975 -2.799346
H  3.524416 -1.962216 -2.455328
H  2.937761 -2.812969 -1.015779
H  2.291593 -3.212476 -2.605215
H  5.727623 -1.418132 1.047884
H  5.52781 -1.667924 2.781478
H  4.321399 -2.302489 1.664517
elementType: S P O N C H
totalener: -1693.87491733 hartree
nucrepener: 2215.71466735 hartree
electener: -3909.58958468 hartree
oneelecener: -6730.34960937 hartree
twoeener: 2820.76002468 hartree
cpcmener: -0.03683446 hartree
kineticenergy: 1688.40760422 hartree
xcener: -126.690795153235 hartree
chargesum: -0.0000000
charge: -0.439206 0.782170 -0.323684 -0.349389 -0.354360 -0.560319 0.087346 -0.243902 0.198120 0.320348 0.377465 -0.137538 -0.149952 -0.246472 -0.228885 0.059652 0.049230 -0.114732 -0.122453 -0.160745 -0.237277 -0.239082 0.164280 0.153575 0.145925 0.155805 0.082787 0.113582 0.109813 0.089336 0.161052 0.162519 0.162898 0.093485 0.074350 0.098204 0.092307 0.097925 0.075824
qa: -0.4392 0.7822 -0.3237 -0.3494 -0.3544 -0.5603 0.0873 -0.2439 0.1981 0.3203 0.3775 -0.1375 -0.1500 -0.2465 -0.2289 0.0597 0.0492 -0.1147 -0.1225 -0.1607 -0.2373 -0.2391 0.1643 0.1536 0.1459 0.1558 0.0828 0.1136 0.1098 0.0893 0.1611 0.1625 0.1629 0.0935 0.0743 0.0982 0.0923 0.0979 0.0758
va: 1.9724 5.4600 2.1764 2.0896 2.1059 1.9436 3.2571 2.9115 3.5620 4.0448 4.1529 3.9319 3.9040 3.9932 4.0205 3.8340 3.8362 3.8897 3.8887 3.9080 3.9435 3.9185 0.9945 1.0004 1.0231 1.0089 1.0089 0.9916 0.9962 1.0130 0.9902 0.9897 0.9882 1.0059 1.0125 1.0084 1.0033 1.0089 1.0158
dispcorr: -0.019743764 hartree
energy: -1693.894661096566
dipole: 12.26186 -10.01411 2.24775 -13.48555 13.24172 -0.24383 -5.40485 5.18089 -0.22395
magnitude: 2.27200 au
magnitude: 5.77498 debye
