program: Orca
programVersion: 5.0.2
elementType: S P O O O O N N C C C C C C C C C C C C C C H H H H H H H H H H H H H H H H H
charge: 0
multiplicity: 1
keywords: wb97x-d3
keywords: def2-TZVPP
keywords: def2/J RIJCOSX
keywords: DEFGRID2
keywords: scfconv7
keywords: smallprint printgap noloewdin
keywords: NOSOSCF
formula: C14H17N2O4PS
InChI: InChI=1/C14H17N2O4PS/c1-3-18-21(22,19-4-2)20-13-10-11-14(17)16(15-13)12-8-6-5-7-9-12/h5-11H,3-4H2,1-2H3
39 atoms
S  1.889115 -0.902951 -1.593315
P  2.343199 -0.36042 0.186905
O  1.593011 1.016255 0.691237
O  3.851995 0.042996 0.465786
O  2.190845 -1.369661 1.39709
O  -3.418844 2.369287 -0.472426
N  -1.804028 0.819414 -0.062658
N  -0.558806 0.46756 0.259207
C  -2.711156 -0.277258 -0.169421
C  0.334283 1.377018 0.359031
C  -2.245765 2.11775 -0.24047
C  0.069392 2.760963 0.160227
C  -1.196885 3.111835 -0.127438
C  -3.352147 -0.531839 -1.372721
C  -2.907179 -1.098375 0.930288
C  4.723869 0.565956 -0.555428
C  0.967854 -1.913244 1.934921
C  -4.198078 -1.625901 -1.471701
C  -3.748452 -2.195375 0.8194
C  -4.397451 -2.458238 -0.378741
C  4.392497 1.988189 -0.932373
C  0.341655 -2.960954 1.049289
H  0.865376 3.488692 0.247311
H  -1.476205 4.145343 -0.28084
H  -3.177933 0.101565 -2.232498
H  -2.4003 -0.889066 1.863745
H  5.720019 0.501028 -0.120929
H  4.695135 -0.089835 -1.427602
H  1.268446 -2.349418 2.886439
H  0.268241 -1.105213 2.151016
H  -4.696023 -1.83147 -2.410159
H  -3.900074 -2.840954 1.674341
H  -5.057044 -3.311862 -0.462093
H  5.15804 2.356643 -1.616318
H  3.432829 2.066098 -1.444163
H  4.38108 2.643863 -0.0616
H  -0.494569 -3.411354 1.585762
H  -0.041457 -2.545917 0.119041
H  1.049359 -3.755318 0.810697
elementType: S P O N C H
totalener: -1693.88138653 hartree
nucrepener: 2233.01255458 hartree
electener: -3926.89394111 hartree
oneelecener: -6764.51340538 hartree
twoeener: 2837.61946427 hartree
cpcmener: -0.03332492 hartree
kineticenergy: 1688.40630421 hartree
xcener: -126.689720944885 hartree
chargesum: -0.0000000
charge: -0.433467 0.745762 -0.327587 -0.343440 -0.329167 -0.518803 0.084799 -0.241500 0.193224 0.346308 0.345943 -0.145659 -0.148928 -0.213095 -0.265344 0.029622 0.034233 -0.118294 -0.103486 -0.154366 -0.239797 -0.258443 0.162217 0.152050 0.152728 0.154543 0.108639 0.095291 0.115715 0.095398 0.158873 0.158705 0.159685 0.099637 0.077521 0.090994 0.096473 0.077339 0.105676
qa: -0.4335 0.7458 -0.3276 -0.3434 -0.3292 -0.5188 0.0848 -0.2415 0.1932 0.3463 0.3459 -0.1457 -0.1489 -0.2131 -0.2653 0.0296 0.0342 -0.1183 -0.1035 -0.1544 -0.2398 -0.2584 0.1622 0.1520 0.1527 0.1545 0.1086 0.0953 0.1157 0.0954 0.1589 0.1587 0.1597 0.0996 0.0775 0.0910 0.0965 0.0773 0.1057
va: 1.9821 5.4993 2.1174 2.1235 2.1402 1.9990 3.2318 2.9381 3.5485 3.9981 4.2053 3.9388 3.8954 4.0327 4.0210 3.8650 3.8504 3.8916 3.8724 3.9110 3.8872 3.9119 0.9936 1.0006 1.0061 1.0056 0.9922 1.0113 0.9877 1.0049 0.9907 0.9914 0.9893 1.0095 1.0168 1.0059 1.0097 1.0132 1.0085
dispcorr: -0.021267654 hartree
energy: -1693.902654186731
dipole: 2.88964 -1.60282 1.28682 -5.58850 5.77588 0.18737 1.46359 -0.47593 0.98766
magnitude: 1.63294 au
magnitude: 4.15061 debye
