program: Orca
programVersion: 5.0.2
elementType: S P O O O O N N C C C C C C C C C C C C C C H H H H H H H H H H H H H H H H H
charge: 0
multiplicity: 1
keywords: wb97x-d3
keywords: def2-TZVPP
keywords: def2/J RIJCOSX
keywords: DEFGRID2
keywords: scfconv7
keywords: smallprint printgap noloewdin
keywords: NOSOSCF
formula: C14H17N2O4PS
InChI: InChI=1/C14H17N2O4PS/c1-3-18-21(22,19-4-2)20-13-10-11-14(17)16(15-13)12-8-6-5-7-9-12/h5-11H,3-4H2,1-2H3
39 atoms
S  1.003919 -1.539483 2.036937
P  1.919321 -0.23339 0.975192
O  1.356785 1.305038 1.052934
O  2.076241 -0.513157 -0.579101
O  3.387398 0.174978 1.415927
O  -3.516463 2.653057 -0.578992
N  -1.811151 1.148904 -0.400618
N  -0.594699 0.79694 0.027919
C  -2.557765 0.070573 -0.959297
C  0.137761 1.668014 0.607709
C  -2.372309 2.402679 -0.232584
C  -0.256964 3.020784 0.811727
C  -1.483597 3.367526 0.387629
C  -3.211445 0.213024 -2.175991
C  -2.588342 -1.139005 -0.276299
C  1.268053 -1.412951 -1.363389
C  4.320674 -0.775138 1.969723
C  -3.910446 -0.864495 -2.699999
C  -3.281871 -2.211871 -0.81486
C  -3.950764 -2.075817 -2.023259
C  2.172733 -2.28357 -2.197539
C  4.747836 -1.835728 0.984035
H  0.41441 3.724164 1.286249
H  -1.861678 4.37306 0.511807
H  -3.163558 1.142026 -2.727116
H  -2.065553 -1.244079 0.665811
H  0.638176 -2.016879 -0.70865
H  0.617776 -0.804436 -1.991328
H  5.170378 -0.168609 2.277728
H  3.885673 -1.223727 2.864791
H  -4.419324 -0.755114 -3.648805
H  -3.302636 -3.153612 -0.281804
H  -4.498563 -2.912098 -2.437914
H  2.816322 -1.690602 -2.848186
H  2.799462 -2.924824 -1.57702
H  1.560837 -2.925686 -2.832203
H  3.940577 -2.53025 0.748829
H  5.120635 -1.400416 0.056647
H  5.556756 -2.417731 1.427589
elementType: S P O N C H
totalener: -1693.88493829 hartree
nucrepener: 2223.10076831 hartree
electener: -3916.98570660 hartree
oneelecener: -6744.70479227 hartree
twoeener: 2827.71908567 hartree
cpcmener: -0.02952707 hartree
kineticenergy: 1688.40526914 hartree
xcener: -126.690763742715 hartree
chargesum: -0.0000000
charge: -0.434917 0.751103 -0.316304 -0.330534 -0.338865 -0.517041 0.093559 -0.263257 0.163835 0.348731 0.353791 -0.155190 -0.147796 -0.206609 -0.226414 0.082242 0.028203 -0.126784 -0.113508 -0.156564 -0.252553 -0.243975 0.162121 0.151946 0.147986 0.138482 0.086973 0.095566 0.109362 0.096269 0.158254 0.157124 0.159246 0.091939 0.085981 0.095983 0.074686 0.094537 0.102392
qa: -0.4349 0.7511 -0.3163 -0.3305 -0.3389 -0.5170 0.0936 -0.2633 0.1638 0.3487 0.3538 -0.1552 -0.1478 -0.2066 -0.2264 0.0822 0.0282 -0.1268 -0.1135 -0.1566 -0.2526 -0.2440 0.1621 0.1519 0.1480 0.1385 0.0870 0.0956 0.1094 0.0963 0.1583 0.1571 0.1592 0.0919 0.0860 0.0960 0.0747 0.0945 0.1024
va: 1.9865 5.4971 2.2005 2.0941 2.1204 1.9969 3.2527 2.9233 3.5708 4.0160 4.1859 3.9325 3.8922 4.0117 3.9774 3.7897 3.8614 3.9032 3.8918 3.9078 3.9647 3.8853 0.9953 1.0012 1.0136 1.0275 1.0147 0.9934 0.9920 1.0091 0.9913 0.9913 0.9893 1.0035 1.0023 1.0080 1.0157 1.0049 1.0098
dispcorr: -0.020480737 hartree
energy: -1693.905419030688
dipole: 11.02209 -8.97025 2.05184 -15.08709 14.58531 -0.50178 -9.82736 9.18540 -0.64196
magnitude: 2.20770 au
magnitude: 5.61152 debye
