program: Orca
programVersion: 5.0.2
elementType: S P O O O O N N C C C C C C C C C C C C C C H H H H H H H H H H H H H H H H H
charge: 0
multiplicity: 1
keywords: wb97x-d3
keywords: def2-TZVPP
keywords: def2/J RIJCOSX
keywords: DEFGRID2
keywords: scfconv7
keywords: smallprint printgap noloewdin
keywords: NOSOSCF
formula: C14H17N2O4PS
InChI: InChI=1/C14H17N2O4PS/c1-3-18-21(22,19-4-2)20-13-10-11-14(17)16(15-13)12-8-6-5-7-9-12/h5-11H,3-4H2,1-2H3
39 atoms
S  0.954185 -1.777838 1.926497
P  1.941043 -0.356863 1.109614
O  1.35158 1.15983 1.306021
O  2.205603 -0.440703 -0.454549
O  3.370227 -0.006999 1.70706
O  -3.432453 2.724007 -0.412938
N  -1.779934 1.171162 -0.237708
N  -0.568469 0.76664 0.158095
C  -2.506367 0.208014 -1.001059
C  0.136055 1.556199 0.875906
C  -2.334378 2.408932 0.021529
C  -0.29118 2.857701 1.266821
C  -1.497113 3.266645 0.837191
C  -3.68155 -0.326121 -0.493588
C  -2.011558 -0.1984 -2.230418
C  1.546884 -1.361989 -1.348741
C  4.204421 -1.001466 2.336418
C  -4.36665 -1.280057 -1.230799
C  -2.697308 -1.16135 -2.956663
C  -3.875997 -1.700131 -2.460274
C  1.679322 -0.817416 -2.748074
C  4.790159 -1.979313 1.347937
H  0.345584 3.480894 1.880669
H  -1.884343 4.245592 1.085255
H  -4.053824 -0.012763 0.473153
H  -1.098634 0.233984 -2.618708
H  2.028287 -2.337701 -1.259187
H  0.49962 -1.473286 -1.068817
H  4.987806 -0.428663 2.82978
H  3.629641 -1.518157 3.107606
H  -5.2835 -1.700194 -0.83862
H  -2.311313 -1.483623 -3.915015
H  -4.412114 -2.447586 -3.030393
H  1.182199 -1.493743 -3.444573
H  1.213099 0.164421 -2.84048
H  2.723313 -0.733922 -3.05164
H  5.472572 -2.646158 1.875988
H  4.024864 -2.601326 0.882002
H  5.355751 -1.473323 0.565814
elementType: S P O N C H
totalener: -1693.88502545 hartree
nucrepener: 2219.27905103 hartree
electener: -3913.16407648 hartree
oneelecener: -6737.16642197 hartree
twoeener: 2824.00234549 hartree
cpcmener: -0.03313193 hartree
kineticenergy: 1688.39866074 hartree
xcener: -126.687002662116 hartree
chargesum: -0.0000000
charge: -0.433361 0.750794 -0.314472 -0.335073 -0.342248 -0.520473 0.068803 -0.244657 0.183870 0.328157 0.347850 -0.149771 -0.142797 -0.210919 -0.269283 0.046587 0.029683 -0.115516 -0.110556 -0.151665 -0.268756 -0.239082 0.160589 0.152497 0.152338 0.176508 0.120536 0.098949 0.109532 0.095539 0.158142 0.155777 0.159265 0.096028 0.085400 0.102334 0.098743 0.078368 0.092342
qa: -0.4334 0.7508 -0.3145 -0.3351 -0.3422 -0.5205 0.0688 -0.2447 0.1839 0.3282 0.3478 -0.1498 -0.1428 -0.2109 -0.2693 0.0466 0.0297 -0.1155 -0.1106 -0.1517 -0.2688 -0.2391 0.1606 0.1525 0.1523 0.1765 0.1205 0.0989 0.1095 0.0955 0.1581 0.1558 0.1593 0.0960 0.0854 0.1023 0.0987 0.0784 0.0923
va: 1.9891 5.4981 2.1969 2.0737 2.1184 1.9970 3.2371 2.9343 3.5757 4.0397 4.2013 3.9288 3.8876 4.0338 4.0170 3.7758 3.8597 3.8851 3.8957 3.9093 3.9635 3.8929 0.9959 1.0005 1.0051 0.9885 0.9960 1.0038 0.9925 1.0116 0.9907 0.9934 0.9895 1.0043 1.0058 1.0064 1.0085 1.0157 1.0060
dispcorr: -0.020390472 hartree
energy: -1693.905415925413
dipole: 10.13786 -8.13936 1.99850 -11.36632 10.81835 -0.54797 -10.97554 10.61421 -0.36133
magnitude: 2.10352 au
magnitude: 5.34673 debye
