program: Orca
programVersion: 5.0.2
elementType: S P O O O O N N C C C C C C C C C C C C C C H H H H H H H H H H H H H H H H H
charge: 0
multiplicity: 1
keywords: wb97x-d3
keywords: def2-TZVPP
keywords: def2/J RIJCOSX
keywords: DEFGRID2
keywords: scfconv7
keywords: smallprint printgap noloewdin
keywords: NOSOSCF
formula: C14H17N2O4PS
InChI: InChI=1/C14H17N2O4PS/c1-3-18-21(22,19-4-2)20-13-10-11-14(17)16(15-13)12-8-6-5-7-9-12/h5-11H,3-4H2,1-2H3
39 atoms
S  1.053996 -1.619062 2.10602
P  1.961017 -0.30612 1.049094
O  1.386993 1.226793 1.115032
O  2.092512 -0.578202 -0.511463
O  3.427112 0.116212 1.490101
O  -3.488046 2.586588 -0.52094
N  -1.795722 1.0827 -0.306003
N  -0.56636 0.725785 0.077616
C  -2.521061 0.055232 -0.980922
C  0.152229 1.578732 0.702508
C  -2.364543 2.325603 -0.115545
C  -0.27819 2.903719 1.000571
C  -1.509016 3.258267 0.593083
C  -3.645621 -0.496246 -0.386722
C  -2.066262 -0.399214 -2.209153
C  1.422864 -1.657023 -1.197248
C  4.371896 -0.841283 2.011059
C  -4.321425 -1.519442 -1.034621
C  -2.743981 -1.42821 -2.847158
C  -3.871867 -1.986893 -2.262501
C  1.565826 -1.423347 -2.678259
C  4.811711 -1.859638 0.986522
H  0.372771 3.585664 1.531322
H  -1.902311 4.248728 0.778332
H  -3.982729 -0.143207 0.579405
H  -1.190017 0.044929 -2.663851
H  1.883751 -2.601709 -0.904041
H  0.373227 -1.685212 -0.905043
H  5.214645 -0.237153 2.342188
H  3.941896 -1.32784 2.889139
H  -5.197635 -1.955856 -0.573523
H  -2.391056 -1.788474 -3.804737
H  -4.400646 -2.787521 -2.76266
H  1.053632 -2.223159 -3.213869
H  1.117071 -0.476868 -2.981316
H  2.610776 -1.428358 -2.990236
H  5.620673 -2.455775 1.411469
H  4.010359 -2.548908 0.715738
H  5.189094 -1.385229 0.08001
elementType: S P O N C H
totalener: -1693.88545153 hartree
nucrepener: 2222.37359686 hartree
electener: -3916.25904839 hartree
oneelecener: -6743.33866433 hartree
twoeener: 2827.07961595 hartree
cpcmener: -0.03346128 hartree
kineticenergy: 1688.40140750 hartree
xcener: -126.686823393665 hartree
chargesum: 0.0000000
charge: -0.431175 0.741691 -0.314463 -0.334160 -0.338304 -0.521965 0.071836 -0.244312 0.187508 0.327909 0.346912 -0.151809 -0.140751 -0.215103 -0.278320 0.043556 0.026594 -0.112194 -0.098003 -0.154422 -0.261742 -0.242467 0.161540 0.152559 0.153012 0.170849 0.119935 0.104236 0.109860 0.095608 0.158132 0.156279 0.158960 0.093713 0.084277 0.101004 0.101268 0.078984 0.092967
qa: -0.4312 0.7417 -0.3145 -0.3342 -0.3383 -0.5220 0.0718 -0.2443 0.1875 0.3279 0.3469 -0.1518 -0.1408 -0.2151 -0.2783 0.0436 0.0266 -0.1122 -0.0980 -0.1544 -0.2617 -0.2425 0.1615 0.1526 0.1530 0.1708 0.1199 0.1042 0.1099 0.0956 0.1581 0.1563 0.1590 0.0937 0.0843 0.1010 0.1013 0.0790 0.0930
va: 1.9918 5.5015 2.1964 2.0681 2.1200 1.9957 3.2302 2.9354 3.5520 4.0451 4.2033 3.9307 3.8846 4.0395 4.0249 3.7703 3.8631 3.8826 3.8764 3.9127 3.9653 3.8876 0.9955 1.0004 1.0049 0.9919 0.9961 1.0010 0.9920 1.0101 0.9908 0.9927 0.9897 1.0054 1.0053 1.0060 1.0085 1.0131 1.0066
dispcorr: -0.020599755 hartree
energy: -1693.906051284758
dipole: 9.97302 -7.93317 2.03985 -13.15558 12.48958 -0.66600 -11.25785 10.72589 -0.53196
magnitude: 2.21077 au
magnitude: 5.61933 debye
