program: Orca
programVersion: 5.0.2
elementType: S P O O O O N N C C C C C C C C C C C C C C H H H H H H H H H H H H H H H H H
charge: 0
multiplicity: 1
keywords: wb97x-d3
keywords: def2-TZVPP
keywords: def2/J RIJCOSX
keywords: DEFGRID2
keywords: scfconv7
keywords: smallprint printgap noloewdin
keywords: NOSOSCF
formula: C14H17N2O4PS
InChI: InChI=1/C14H17N2O4PS/c1-3-18-21(22,19-4-2)20-13-10-11-14(17)16(15-13)12-8-6-5-7-9-12/h5-11H,3-4H2,1-2H3
39 atoms
S  1.613402 -0.548135 -2.305591
P  2.136752 0.029003 -0.561133
O  1.520018 1.469804 -0.066499
O  3.676886 0.375723 -0.466227
O  1.804111 -0.893573 0.691275
O  -3.699582 2.346238 0.473674
N  -1.928165 0.952536 0.139532
N  -0.617681 0.716288 0.030023
C  -2.730911 -0.226875 0.156234
C  0.193687 1.703827 0.046334
C  -2.496783 2.200787 0.315965
C  -0.220575 3.060008 0.171945
C  -1.538615 3.288968 0.301056
C  -2.41689 -1.233591 1.058613
C  -3.784024 -0.376441 -0.735154
C  4.373707 0.674764 0.767355
C  1.3215 -2.247493 0.581555
C  -3.159509 -2.404757 1.062564
C  -4.52792 -1.54719 -0.715515
C  -4.218697 -2.562142 0.179587
C  5.368395 -0.416683 1.064239
C  2.446723 -3.22701 0.36423
H  0.508066 3.859832 0.163459
H  -1.930763 4.291055 0.408635
H  -1.595289 -1.105097 1.751555
H  -4.014381 0.398663 -1.453524
H  4.871695 1.630419 0.606107
H  3.676325 0.803094 1.596644
H  0.812455 -2.440716 1.524809
H  0.582158 -2.309038 -0.218749
H  -2.912017 -3.191101 1.763637
H  -5.347556 -1.667911 -1.411711
H  -4.800584 -3.474616 0.187424
H  4.874032 -1.370483 1.250689
H  6.07721 -0.54511 0.245795
H  5.93513 -0.152461 1.957858
H  2.038811 -4.238618 0.351032
H  2.95201 -3.061359 -0.587986
H  3.184545 -3.176579 1.165428
elementType: S P O N C H
totalener: -1693.88491612 hartree
nucrepener: 2212.24699707 hartree
electener: -3906.13191318 hartree
oneelecener: -6723.03784296 hartree
twoeener: 2816.90592978 hartree
cpcmener: -0.03500094 hartree
kineticenergy: 1688.39165279 hartree
xcener: -126.684739141340 hartree
chargesum: -0.0000000
charge: -0.417815 0.724500 -0.313637 -0.342010 -0.331910 -0.519317 0.074400 -0.243151 0.198644 0.328953 0.350115 -0.148878 -0.146631 -0.244859 -0.215737 0.044201 0.057736 -0.109547 -0.121472 -0.157142 -0.243821 -0.260703 0.160759 0.151687 0.149809 0.151267 0.104219 0.094301 0.106646 0.092882 0.156721 0.158297 0.159069 0.082050 0.091749 0.094628 0.105078 0.086179 0.092740
qa: -0.4178 0.7245 -0.3136 -0.3420 -0.3319 -0.5193 0.0744 -0.2432 0.1986 0.3290 0.3501 -0.1489 -0.1466 -0.2449 -0.2157 0.0442 0.0577 -0.1095 -0.1215 -0.1571 -0.2438 -0.2607 0.1608 0.1517 0.1498 0.1513 0.1042 0.0943 0.1066 0.0929 0.1567 0.1583 0.1591 0.0820 0.0917 0.0946 0.1051 0.0862 0.0927
va: 2.0190 5.5042 2.1631 2.1253 2.0535 1.9970 3.2449 2.9185 3.5936 4.0348 4.1998 3.9291 3.8922 4.0180 4.0229 3.8581 3.8109 3.8886 3.8955 3.9129 3.9419 3.9527 0.9959 1.0008 1.0068 1.0090 0.9939 0.9991 0.9884 1.0096 0.9923 0.9910 0.9893 1.0058 1.0041 1.0089 1.0103 1.0148 0.9998
dispcorr: -0.020105659 hartree
energy: -1693.905021777882
dipole: 11.47906 -9.56439 1.91467 -14.89649 14.43748 -0.45901 9.92343 -8.04077 1.88266
magnitude: 2.72416 au
magnitude: 6.92426 debye
