program: Orca
programVersion: 5.0.2
elementType: S P O O O O N N C C C C C C C C C C C C C C H H H H H H H H H H H H H H H H H
charge: 0
multiplicity: 1
keywords: wb97x-d3
keywords: def2-TZVPP
keywords: def2/J RIJCOSX
keywords: DEFGRID2
keywords: scfconv7
keywords: smallprint printgap noloewdin
keywords: NOSOSCF
formula: C14H17N2O4PS
InChI: InChI=1/C14H17N2O4PS/c1-3-18-21(22,19-4-2)20-13-10-11-14(17)16(15-13)12-8-6-5-7-9-12/h5-11H,3-4H2,1-2H3
39 atoms
S  4.147193 -0.033209 -0.726318
P  2.263887 -0.162002 -0.410644
O  1.557042 1.287371 -0.674576
O  1.810015 -0.611173 1.046054
O  1.402567 -1.095214 -1.361501
O  -3.638134 2.392666 -0.315533
N  -1.869449 0.979015 -0.027782
N  -0.571478 0.684172 -0.138625
C  -2.6754 -0.13352 0.355096
C  0.240681 1.580569 -0.54405
C  -2.432797 2.198426 -0.361962
C  -0.155814 2.908179 -0.873878
C  -1.465149 3.19574 -0.77741
C  -2.467179 -1.35171 -0.280263
C  -3.623404 -0.014111 1.362606
C  2.553318 -0.263779 2.233993
C  1.862872 -2.39196 -1.799975
C  -3.219159 -2.455158 0.091677
C  -4.375435 -1.123644 1.720898
C  -4.179844 -2.34311 1.087339
C  2.453304 1.201489 2.581105
C  1.767293 -3.435446 -0.715354
H  0.575706 3.640188 -1.189323
H  -1.846975 4.177776 -1.021593
H  -1.718277 -1.441252 -1.05665
H  -3.769107 0.92323 1.881518
H  2.115454 -0.878733 3.018311
H  3.594114 -0.568648 2.107942
H  1.214931 -2.641826 -2.638278
H  2.883519 -2.303677 -2.178477
H  -3.054452 -3.403182 -0.404314
H  -5.113174 -1.031102 2.507365
H  -4.77036 -3.204185 1.371902
H  2.938644 1.365638 3.54387
H  2.957572 1.836937 1.852239
H  1.416375 1.524704 2.672933
H  1.989318 -4.411215 -1.148645
H  2.48215 -3.265625 0.090036
H  0.764396 -3.4798 -0.290067
elementType: S P O N C H
totalener: -1693.88414443 hartree
nucrepener: 2225.70825740 hartree
electener: -3919.59240183 hartree
oneelecener: -6749.90586673 hartree
twoeener: 2830.31346490 hartree
cpcmener: -0.03265288 hartree
kineticenergy: 1688.38611276 hartree
xcener: -126.684646367006 hartree
chargesum: -0.0000000
charge: -0.416712 0.697319 -0.307270 -0.320160 -0.321815 -0.516821 0.071650 -0.229322 0.183032 0.331139 0.354007 -0.160708 -0.149709 -0.208239 -0.211582 0.034032 0.017032 -0.127576 -0.126255 -0.158804 -0.246462 -0.233407 0.160231 0.151995 0.144251 0.148026 0.110816 0.096124 0.109560 0.099910 0.157502 0.158251 0.159265 0.105260 0.084792 0.091155 0.099113 0.081319 0.089060
qa: -0.4167 0.6973 -0.3073 -0.3202 -0.3218 -0.5168 0.0717 -0.2293 0.1830 0.3311 0.3540 -0.1607 -0.1497 -0.2082 -0.2116 0.0340 0.0170 -0.1276 -0.1263 -0.1588 -0.2465 -0.2334 0.1602 0.1520 0.1443 0.1480 0.1108 0.0961 0.1096 0.0999 0.1575 0.1583 0.1593 0.1053 0.0848 0.0912 0.0991 0.0813 0.0891
va: 2.0449 5.5211 2.1657 2.0640 2.1075 1.9972 3.2686 2.8724 3.6282 4.0065 4.1921 3.9434 3.8972 4.0127 4.0117 3.8413 3.8580 3.9076 3.9012 3.9130 3.9065 3.8993 0.9974 1.0009 1.0187 1.0132 0.9914 1.0124 0.9908 1.0121 0.9919 0.9913 0.9895 1.0098 1.0162 1.0061 1.0098 1.0141 1.0042
dispcorr: -0.019897322 hartree
energy: -1693.904041750510
dipole: 0.31590 0.30967 0.62557 -12.44523 11.58569 -0.85955 8.96837 -8.22453 0.74384
magnitude: 1.29748 au
magnitude: 3.29793 debye
