program: Orca
programVersion: 5.0.2
elementType: S P O O O O N N C C C C C C C C C C C C C C H H H H H H H H H H H H H H H H H
charge: 0
multiplicity: 1
keywords: wb97x-d3
keywords: def2-TZVPP
keywords: def2/J RIJCOSX
keywords: DEFGRID2
keywords: scfconv7
keywords: smallprint printgap noloewdin
keywords: NOSOSCF
formula: C14H17N2O4PS
InChI: InChI=1/C14H17N2O4PS/c1-3-18-21(22,19-4-2)20-13-10-11-14(17)16(15-13)12-8-6-5-7-9-12/h5-11H,3-4H2,1-2H3
39 atoms
S  1.822805 -0.649156 -1.868505
P  2.151827 0.045498 -0.115617
O  1.455685 1.478322 0.255192
O  3.644946 0.445576 0.244386
O  1.685476 -0.807383 1.140125
O  -3.808205 2.230547 0.381092
N  -1.983539 0.904064 0.045271
N  -0.663909 0.695583 0.04912
C  -2.751655 -0.274844 -0.184807
C  0.119136 1.68469 0.247969
C  -2.593538 2.117874 0.309716
C  -0.333178 3.016762 0.464709
C  -1.662435 3.213884 0.493699
C  -3.749093 -0.287938 -1.150563
C  -2.452435 -1.420937 0.539157
C  4.733105 0.462497 -0.700756
C  1.73837 -2.247367 1.145452
C  -4.455401 -1.458554 -1.381344
C  -3.158868 -2.588533 0.294117
C  -4.164725 -2.609316 -0.661582
C  5.414354 -0.880417 -0.772852
C  1.185887 -2.726458 2.461627
H  0.375999 3.821465 0.605574
H  -2.085143 4.19413 0.66639
H  -3.965114 0.594977 -1.736137
H  -1.668222 -1.402635 1.285443
H  4.373627 0.77582 -1.681598
H  5.413972 1.228501 -0.334201
H  1.149864 -2.632158 0.31064
H  2.77232 -2.574291 1.013098
H  -5.229954 -1.470649 -2.136966
H  -2.923669 -3.482352 0.856854
H  -4.715334 -3.521448 -0.850978
H  6.279239 -0.806985 -1.433624
H  5.768894 -1.202439 0.206452
H  4.752053 -1.646545 -1.175739
H  1.21489 -3.815725 2.485385
H  1.771563 -2.357436 3.303595
H  0.148744 -2.41722 2.595678
elementType: S P O N C H
totalener: -1693.88431105 hartree
nucrepener: 2204.34312965 hartree
electener: -3898.22744070 hartree
oneelecener: -6707.55325153 hartree
twoeener: 2809.32581083 hartree
cpcmener: -0.03314227 hartree
kineticenergy: 1688.41727638 hartree
xcener: -126.689685014300 hartree
chargesum: -0.0000000
charge: -0.432305 0.757921 -0.316685 -0.346410 -0.326051 -0.517815 0.073496 -0.241136 0.170650 0.330613 0.351311 -0.154166 -0.148106 -0.195403 -0.207616 0.053091 0.018734 -0.134235 -0.138873 -0.148087 -0.241809 -0.247515 0.161319 0.152014 0.148988 0.152267 0.087761 0.107437 0.103034 0.119462 0.157958 0.155913 0.158954 0.098334 0.089939 0.076626 0.090257 0.092900 0.087235
qa: -0.4323 0.7579 -0.3167 -0.3464 -0.3261 -0.5178 0.0735 -0.2411 0.1707 0.3306 0.3513 -0.1542 -0.1481 -0.1954 -0.2076 0.0531 0.0187 -0.1342 -0.1389 -0.1481 -0.2418 -0.2475 0.1613 0.1520 0.1490 0.1523 0.0878 0.1074 0.1030 0.1195 0.1580 0.1559 0.1590 0.0983 0.0899 0.0766 0.0903 0.0929 0.0872
va: 1.9896 5.4924 2.2009 2.1101 2.0951 1.9966 3.2597 2.9093 3.6434 4.0273 4.1984 3.9330 3.8930 4.0001 3.9935 3.8348 3.8387 3.9096 3.9210 3.9063 3.9062 3.9713 0.9961 1.0008 1.0115 1.0080 1.0147 0.9948 1.0002 0.9868 0.9915 0.9925 0.9892 1.0094 1.0041 1.0203 1.0061 1.0037 1.0024
dispcorr: -0.019175193 hartree
energy: -1693.903486239474
dipole: 10.50234 -8.18719 2.31515 -15.27594 14.75712 -0.51882 4.47851 -3.87965 0.59886
magnitude: 2.44698 au
magnitude: 6.21974 debye
