program: Orca
programVersion: 5.0.2
elementType: S P O O O O N N C C C C C C C C C C C C C C H H H H H H H H H H H H H H H H H
charge: 0
multiplicity: 1
keywords: wb97x-d3
keywords: def2-TZVPP
keywords: def2/J RIJCOSX
keywords: DEFGRID2
keywords: scfconv7
keywords: smallprint printgap noloewdin
keywords: NOSOSCF
formula: C14H17N2O4PS
InChI: InChI=1/C14H17N2O4PS/c1-3-18-21(22,19-4-2)20-13-10-11-14(17)16(15-13)12-8-6-5-7-9-12/h5-11H,3-4H2,1-2H3
39 atoms
S  1.739675 -0.781876 -1.975842
P  2.168057 -0.423666 -0.146888
O  1.614309 1.006309 0.453956
O  3.700461 -0.247129 0.229048
O  1.655214 -1.529193 0.860453
O  -3.499238 2.411548 0.046846
N  -1.858642 0.829476 0.150579
N  -0.574296 0.472548 0.235005
C  -2.734935 -0.25597 -0.145882
C  0.315396 1.376275 0.390504
C  -2.319346 2.134521 0.198704
C  0.016105 2.761955 0.517918
C  -1.278037 3.116295 0.4349
C  -2.371023 -1.136541 -1.156499
C  -3.906604 -0.448706 0.573082
C  4.694231 0.219224 -0.707347
C  1.729792 -1.416168 2.300233
C  -3.190786 -2.21317 -1.455079
C  -4.723947 -1.525038 0.25929
C  -4.372499 -2.406586 -0.753585
C  4.578424 1.695514 -0.994808
C  1.310497 -2.737945 2.886939
H  0.80777 3.482981 0.67291
H  -1.587262 4.149722 0.512607
H  -1.449325 -0.983556 -1.70368
H  -4.17867 0.215837 1.381431
H  5.646421 -0.012093 -0.233037
H  4.624558 -0.367405 -1.625267
H  2.748044 -1.163921 2.601332
H  1.064229 -0.617063 2.631828
H  -2.90511 -2.89808 -2.242822
H  -5.637575 -1.676979 0.819071
H  -5.015363 -3.244165 -0.9917
H  3.659755 1.940529 -1.529059
H  4.624186 2.290328 -0.082474
H  5.413676 1.993321 -1.630035
H  0.291837 -2.99878 2.598616
H  1.97914 -3.542942 2.581573
H  1.34317 -2.669269 3.974638
elementType: S P O N C H
totalener: -1693.88560769 hartree
nucrepener: 2211.89457804 hartree
electener: -3905.78018573 hartree
oneelecener: -6722.57449144 hartree
twoeener: 2816.79430571 hartree
cpcmener: -0.03352635 hartree
kineticenergy: 1688.39297023 hartree
xcener: -126.684490173986 hartree
chargesum: -0.0000000
charge: -0.420593 0.759662 -0.323818 -0.342351 -0.336614 -0.516247 0.071255 -0.237929 0.179520 0.355535 0.352469 -0.159334 -0.151315 -0.200941 -0.210951 0.026934 0.014740 -0.134649 -0.127721 -0.155600 -0.234847 -0.240071 0.160998 0.151946 0.142056 0.147594 0.109939 0.096419 0.112420 0.104712 0.156908 0.157872 0.158752 0.078566 0.090287 0.099009 0.089128 0.089133 0.087126
qa: -0.4206 0.7597 -0.3238 -0.3424 -0.3366 -0.5162 0.0713 -0.2379 0.1795 0.3555 0.3525 -0.1593 -0.1513 -0.2009 -0.2110 0.0269 0.0147 -0.1346 -0.1277 -0.1556 -0.2348 -0.2401 0.1610 0.1519 0.1421 0.1476 0.1099 0.0964 0.1124 0.1047 0.1569 0.1579 0.1588 0.0786 0.0903 0.0990 0.0891 0.0891 0.0871
va: 2.0141 5.4782 2.1187 2.1159 2.1318 1.9980 3.2673 2.8735 3.6190 3.9718 4.1923 3.9433 3.9000 4.0055 4.0127 3.8609 3.8644 3.9216 3.9018 3.9062 3.8829 3.9575 0.9948 1.0012 1.0263 1.0129 0.9913 1.0106 0.9941 0.9908 0.9918 0.9912 0.9895 1.0199 1.0061 1.0094 1.0042 1.0047 1.0064
dispcorr: -0.019239161 hartree
energy: -1693.904846849683
dipole: 8.38600 -6.05313 2.33287 -4.85321 5.33523 0.48201 7.51820 -5.70034 1.81786
magnitude: 2.99654 au
magnitude: 7.61659 debye
