program: Orca
programVersion: 5.0.2
elementType: S P O O O O N N C C C C C C C C C C C C C C H H H H H H H H H H H H H H H H H
charge: 0
multiplicity: 1
keywords: wb97x-d3
keywords: def2-TZVPP
keywords: def2/J RIJCOSX
keywords: DEFGRID2
keywords: scfconv7
keywords: smallprint printgap noloewdin
keywords: NOSOSCF
formula: C14H17N2O4PS
InChI: InChI=1/C14H17N2O4PS/c1-3-18-21(22,19-4-2)20-13-10-11-14(17)16(15-13)12-8-6-5-7-9-12/h5-11H,3-4H2,1-2H3
39 atoms
S  1.63672 -0.691694 -2.320438
P  2.159459 -0.045969 -0.599792
O  1.554536 1.416465 -0.166187
O  3.703839 0.288737 -0.520988
O  1.802205 -0.917925 0.682507
O  -3.638009 2.381832 0.465755
N  -1.897377 0.956758 0.103782
N  -0.59362 0.696486 -0.03047
C  -2.721304 -0.207363 0.143529
C  0.234407 1.669915 -0.030119
C  -2.440859 2.215352 0.287052
C  -0.152836 3.033414 0.102314
C  -1.463933 3.286292 0.255401
C  -2.415726 -1.209699 1.053333
C  -3.789394 -0.34442 -0.731544
C  4.401137 0.813601 0.633588
C  1.347991 -2.283932 0.612657
C  -3.185818 -2.362485 1.084122
C  -4.560172 -1.496592 -0.685548
C  -4.262777 -2.505383 0.220336
C  4.9451 -0.284261 1.51322
C  2.489547 -3.248502 0.412222
H  0.590526 3.819511 0.080847
H  -1.835526 4.295308 0.370861
H  -1.581139 -1.090916 1.732516
H  -4.012745 0.427394 -1.45517
H  5.212418 1.407441 0.215226
H  3.757158 1.490069 1.197838
H  0.849453 -2.461461 1.564342
H  0.604315 -2.381056 -0.180021
H  -2.946115 -3.145477 1.79132
H  -5.393166 -1.606909 -1.367342
H  -4.865647 -3.403485 0.248789
H  5.535646 -0.999856 0.940658
H  5.601432 0.162716 2.261116
H  4.159762 -0.819908 2.043125
H  2.098817 -4.2671 0.423239
H  2.986558 -3.097219 -0.546688
H  3.231693 -3.167628 1.206906
elementType: S P O N C H
totalener: -1693.88411823 hartree
nucrepener: 2215.24651213 hartree
electener: -3909.13063036 hartree
oneelecener: -6729.04784658 hartree
twoeener: 2819.91721622 hartree
cpcmener: -0.03494717 hartree
kineticenergy: 1688.39387139 hartree
xcener: -126.686150443380 hartree
chargesum: 0.0000000
charge: -0.419743 0.728595 -0.316081 -0.340954 -0.334799 -0.519346 0.073583 -0.242446 0.197596 0.328209 0.350200 -0.149822 -0.145948 -0.241024 -0.217308 0.042499 0.047321 -0.110811 -0.120412 -0.157520 -0.258111 -0.248071 0.160815 0.151921 0.149403 0.151342 0.105309 0.102245 0.109057 0.095937 0.156864 0.158422 0.159383 0.091949 0.102453 0.081292 0.103862 0.083911 0.090229
qa: -0.4197 0.7286 -0.3161 -0.3410 -0.3348 -0.5193 0.0736 -0.2424 0.1976 0.3282 0.3502 -0.1498 -0.1459 -0.2410 -0.2173 0.0425 0.0473 -0.1108 -0.1204 -0.1575 -0.2581 -0.2481 0.1608 0.1519 0.1494 0.1513 0.1053 0.1022 0.1091 0.0959 0.1569 0.1584 0.1594 0.0919 0.1025 0.0813 0.1039 0.0839 0.0902
va: 2.0159 5.5081 2.1711 2.1335 2.0527 1.9971 3.2440 2.9193 3.5945 4.0384 4.2002 3.9281 3.8925 4.0180 4.0233 3.8510 3.8088 3.8914 3.8952 3.9130 3.9166 3.9491 0.9956 1.0007 1.0072 1.0089 0.9918 0.9993 0.9892 1.0108 0.9922 0.9909 0.9893 1.0020 1.0098 1.0129 1.0095 1.0175 1.0022
dispcorr: -0.020215176 hartree
energy: -1693.904333407886
dipole: 10.55364 -8.63266 1.92098 -13.81220 13.54869 -0.26351 11.17259 -9.29616 1.87643
magnitude: 2.69825 au
magnitude: 6.85842 debye
