program: Orca
programVersion: 5.0.2
elementType: S P O O O O N N C C C C C C C C C C C C C C H H H H H H H H H H H H H H H H H
charge: 0
multiplicity: 1
keywords: wb97x-d3
keywords: def2-TZVPP
keywords: def2/J RIJCOSX
keywords: DEFGRID2
keywords: scfconv7
keywords: smallprint printgap noloewdin
keywords: NOSOSCF
formula: C14H17N2O4PS
InChI: InChI=1/C14H17N2O4PS/c1-3-18-21(22,19-4-2)20-13-10-11-14(17)16(15-13)12-8-6-5-7-9-12/h5-11H,3-4H2,1-2H3
39 atoms
S  0.95501 -2.119236 1.846898
P  1.944687 -0.766183 0.926842
O  1.495945 0.786057 1.251118
O  2.011496 -0.811357 -0.658259
O  3.454257 -0.669986 1.390101
O  -3.363263 2.604865 0.08716
N  -1.699753 1.059851 -0.120935
N  -0.488632 0.586465 0.186925
C  -2.483315 0.164219 -0.907192
C  0.27846 1.275827 0.940912
C  -2.223935 2.250014 0.349659
C  -0.079879 2.546054 1.475186
C  -1.303941 3.012098 1.172823
C  -2.579353 -1.160055 -0.501107
C  -3.106029 0.596079 -2.070085
C  1.156782 -1.627453 -1.490817
C  4.451849 0.156483 0.743758
C  -3.305788 -2.058796 -1.26648
C  -3.839646 -0.309397 -2.822617
C  -3.942125 -1.635315 -2.425029
C  0.838129 -0.871873 -2.753449
C  5.579555 0.371032 1.718375
H  0.612381 3.098128 2.097133
H  -1.654466 3.963718 1.548774
H  -2.081103 -1.489129 0.402116
H  -3.011583 1.620513 -2.402292
H  1.695638 -2.55109 -1.707982
H  0.246291 -1.887242 -0.951078
H  4.800125 -0.359748 -0.151818
H  4.019592 1.112064 0.441519
H  -3.378389 -3.090762 -0.94926
H  -4.326205 0.025217 -3.729426
H  -4.516793 -2.336227 -3.016077
H  1.737792 -0.628811 -3.320078
H  0.20396 -1.493955 -3.386445
H  0.297784 0.051438 -2.544598
H  6.032979 -0.572407 2.023539
H  6.353307 0.972463 1.240318
H  5.244241 0.90308 2.608825
elementType: S P O N C H
totalener: -1693.88569454 hartree
nucrepener: 2229.35893443 hartree
electener: -3923.24462898 hartree
oneelecener: -6756.96788811 hartree
twoeener: 2833.72325913 hartree
cpcmener: -0.03175230 hartree
kineticenergy: 1688.38849859 hartree
xcener: -126.685295638315 hartree
chargesum: -0.0000000
charge: -0.422432 0.728048 -0.314548 -0.327320 -0.342838 -0.518437 0.113921 -0.258940 0.162681 0.346727 0.352804 -0.150554 -0.148949 -0.248099 -0.219205 0.056657 0.034555 -0.098000 -0.112139 -0.162033 -0.261671 -0.242167 0.161612 0.151420 0.137478 0.146414 0.123053 0.085928 0.100607 0.106394 0.158024 0.158848 0.158517 0.101072 0.093697 0.083875 0.089480 0.087766 0.087751
qa: -0.4224 0.7280 -0.3145 -0.3273 -0.3428 -0.5184 0.1139 -0.2589 0.1627 0.3467 0.3528 -0.1506 -0.1489 -0.2481 -0.2192 0.0567 0.0346 -0.0980 -0.1121 -0.1620 -0.2617 -0.2422 0.1616 0.1514 0.1375 0.1464 0.1231 0.0859 0.1006 0.1064 0.1580 0.1588 0.1585 0.1011 0.0937 0.0839 0.0895 0.0878 0.0878
va: 2.0113 5.5076 2.1508 2.0745 2.1429 1.9970 3.2314 2.9328 3.5399 4.0233 4.1880 3.9320 3.8918 3.9868 4.0094 3.7808 3.8447 3.8806 3.8856 3.9165 3.9504 3.9577 0.9955 1.0013 1.0302 1.0153 0.9997 1.0159 0.9936 0.9930 0.9908 0.9907 0.9898 1.0050 1.0067 1.0047 1.0037 1.0067 1.0054
dispcorr: -0.021013052 hartree
energy: -1693.906707596896
dipole: 9.64541 -7.56605 2.07937 -1.35069 2.11333 0.76264 -12.62580 11.26522 -1.36057
magnitude: 2.59934 au
magnitude: 6.60699 debye
