program: Gaussian 09
title: 000066541
version: EM64L-G09RevD.01
frameworkgroup: C1[X(C7H7N5O2)]
method: RPBEPBE
basis: SDD
operation: Freq
keyword: #pfreq=noraman
keyword: PBEPBE/SDD
title: #p freq=noraman PBEPBE/SDD
converged: YES YES NO NO
title: Mulliken charges:
elementType: O O N N N N N C C C C C C C H H H H H H H
charge: -0.205125 -0.202602 -0.234906 -0.151454 -0.027507 0.070989 0.048272 0.193157 -0.064703 0.203257 0.050992 -0.597989 -0.583206 -0.349391 0.267219 0.257247 0.257082 0.270333 0.254953 0.270375 0.273008
chargesum: 0.00000
title: Mulliken charges with hydrogens summed into heavy atoms:
elementType: O O N N N N N C C C C C C C
charge: -0.205125 -0.202602 -0.234906 -0.151454 -0.027507 0.070989 0.048272 0.193157 -0.064703 0.203257 0.050992 0.183558 0.212454 -0.076383
polarizability: 1.77280126e+02 -1.48030682e+01 1.39338174e+02 -2.94876560e-02 -3.23171877e-03 5.55292139e+01
1716.lowfreq: -8.6406 -6.7613 -0.0009 -0.0006 -0.0003 5.9060 50.7459 67.8352 89.2628
frequency: 50.7415 67.8072 89.2613 123.7781 147.3580 193.3024 226.9461 274.4740 282.8715 326.5512 354.9977 387.9212 427.9344 452.5301 464.8290 511.1855 548.8376 580.4597 661.4380 688.6143 694.0648 723.6101 793.5479 844.0495 872.6025 875.4428 936.1511 998.3741 1014.5940 1088.9581 1116.8047 1124.8987 1178.4172 1193.9661 1234.8029 1246.6655 1264.6432 1311.8130 1357.3569 1396.7286 1421.0603 1433.5392 1444.9971 1464.3526 1470.8169 1472.8414 1485.7038 1559.8936 1583.1723 1628.3630 3015.5988 3016.8309 3105.4636 3107.2079 3144.7070 3162.3075 3209.0501
redmass: 4.9713 1.3031 2.4601 1.1482 4.6162 6.4153 3.9208 5.6259 4.9798 3.8936 5.4153 8.2054 8.1302 5.6741 7.8538 9.5456 6.4442 7.5166 7.7176 6.4717 8.8678 11.2789 11.2684 6.1986 10.2717 1.3610 3.4397 3.3363 3.7848 3.6208 1.3393 1.3192 5.7683 4.4367 4.4957 3.3732 4.8425 5.1605 1.8840 2.2567 1.1938 1.6059 1.0411 1.1820 1.0444 1.1081 4.3405 9.3145 11.5322 10.5371 1.0329 1.0333 1.1004 1.1018 1.1025 1.1038 1.0934
irintensity: 1.5572 1.9331 6.0418 0.7981 0.5297 2.1490 1.6105 0.3472 0.0706 4.3259 3.0230 21.6351 7.2211 7.9923 11.8093 3.4358 9.8194 8.1599 0.7356 5.7636 8.3608 12.0815 3.2796 8.2064 30.1744 15.7859 4.4376 25.9082 24.8488 106.7469 0.8201 0.1769 3.9184 124.1405 7.6846 10.4060 99.6084 4.7519 21.3118 37.8405 72.0712 3.6218 20.3908 26.4514 18.9371 13.2705 55.4784 328.5522 505.8329 40.4331 16.3214 3.9959 4.0879 13.4136 1.9205 2.8383 1.3507
temp: 298.150 k
press: 1.00000 atm
elementType: 8 8 7 7 7 7 7 6 6 6 6 6 6 6 1 1 1 1 1 1 1
symmnumber: 1
zpe: 387920.5 jmol-1
zpe.correction: 0.147751 hartree
zpe.thermalcorrener: 0.159811 hartree
zpe.thermalcorrenthalpy: 0.160755 hartree
zpe.thermalcorrgfe: 0.108971 hartree
zpe.sumelectzpe: -694.115315 hartree
zpe.sumelectthermal: -694.103256 hartree
zpe.sumelectthermalent: -694.102312 hartree
zpe.sumelectthermalfe: -694.154096 hartree
dipole: 4.0730 0.6824 -0.0016
dipole: 4.1297
quadrupole: -71.5594 -97.7323 -77.9004
quadrupole: 5.9148 0.0058 -0.0050
quadrupole: 10.8380 -15.3350 4.4970 5.9148 0.0058 -0.0050
hfenergy: -694.2630665 hartree
pointgroup: C01 [X(C7H7N5O2)]
dipole: 1.5957168 0.3058354 0.0017691 debye
dipolederiv: -0.5367326 -0.2805877 -0.0002711 -0.1254786 -0.962767 -0.0001013 -0.0005669 -0.0000181 -0.3144255 -0.9181053 0.4043147 -0.0007596 0.3184067 -0.8756259 0.0004419 -0.0009037 0.0006176 -0.3426032 -0.5892269 0.1531357 -0.0004247 -0.1573958 -1.2534855 -0.0000117 -0.0015461 0.0004323 -0.1840645 -0.3196713 0.7923498 -0.000565 -0.3053609 -0.1562028 -0.0004633 -0.0004782 0.0012287 -0.0786055 -1.4849644 0.3514088 -0.0018088 0.4508625 -0.5974328 0.0006232 -0.0017792 0.0005733 -0.2796024 0.2205266 0.1454805 0.0003794 0.0071677 -0.2416676 0.0000522 0.0005105 0.0004497 -0.1684748 -0.3333466 -0.3973072 -0.0001416 0.5496939 0.2241979 0.000846 -0.0005361 -0.0007148 -0.1305169 0.7090652 -0.6949173 0.0008093 -0.9177143 0.2761747 -0.0012466 0.000787 -0.0010208 0.2661666 -0.0848329 -0.1982181 -0.0003193 0.5461637 0.0073873 0.0008533 -0.0004244 -0.0002992 0.1400249 0.782343 0.0223118 0.0009169 -0.0076405 1.3196383 -0.0005157 0.0008895 -0.0006065 0.1667015 1.7878528 -0.2472336 0.001941 0.0784233 1.5410595 0.0003017 0.0021322 -0.0002272 0.254643 0.3095517 -0.0006542 -0.0005339 0.08162 0.0376041 0.0001138 0.0003564 -0.0006008 0.1922105 0.2469423 0.1068325 0.0001446 0.1357414 0.1631925 0.000094 0.0003589 0.0001996 0.120504 -0.1203827 -0.2027375 0.0000339 -0.6511943 0.0621061 -0.0011306 0.0004596 -0.000752 -0.0079243 0.1313136 0.0298347 0.0003705 -0.1168555 -0.0087801 -0.0016321 0.0000464 -0.0006805 0.1293339 0.030775 0.0043109 -0.0228113 0.054468 0.0891266 0.0875236 -0.0579292 0.0498838 -0.0279393 0.0289636 0.0044166 0.0233274 0.0531757 0.0902081 -0.0858435 0.0591334 -0.0486775 -0.0305709 0.0726324 0.0017708 -0.0721495 -0.0471761 0.0581372 0.0284341 -0.028129 0.0453953 0.0002154 -0.0438039 -0.0299752 -0.0003733 0.0575039 0.1058479 0.0001599 -0.0004039 -0.0000358 0.1360915 0.0723014 0.0021016 0.0724514 -0.0469378 0.0581298 -0.0286168 0.028434 -0.0454327 0.0008181 0.0387988 0.0333623 -0.0002162 0.0425272 0.0631517 0.0001179 -0.0004114 0.0002856 0.1580182 unknown
polarizability: 177.9509405|-13.9003172|138.6671328|0.1654238|-0.0489667|55.5294409 unknown
InChI: InChI=1S/C7H7N5O2/c1-11-6(13)4-5(10-7(11)14)12(2)9-3-8-4/h3H,1-2H3
charge 0 multiplicity 1
21 atoms
O  -1.607384 -2.406461 -0.002963
O  -2.37643 2.220039 -0.004959
N  -1.982651 -0.081749 -0.004688
N  2.076731 0.740644 0.001671
N  -0.137558 1.541882 -0.001828
N  1.215601 -1.904186 0.001363
N  3.016404 -0.254206 0.003541
C  0.682992 0.503153 -0.000329
C  0.314691 -0.912808 -0.000398
C  -1.153048 -1.232053 -0.002738
C  -1.524941 1.296106 -0.00372
C  -3.451669 -0.279096 -0.00721
C  2.577175 2.128156 0.001743
C  2.54489 -1.521119 0.003088
H  -3.647913 -1.360627 -0.014701
H  -3.890933 0.201375 -0.896409
H  -3.892887 0.18842 0.888035
H  2.197432 2.657662 -0.887494
H  3.674153 2.082679 0.004067
H  2.193702 2.658817 0.888681
H  3.304343 -2.303926 0.005245
