program: Orca
programVersion: 5.0.2
elementType: S P O O O O N N C C C C C C C C C C C C C C H H H H H H H H H H H H H H H H H
charge: 0
multiplicity: 1
keywords: wb97x-d3
keywords: def2-TZVPP
keywords: def2/J RIJCOSX
keywords: DEFGRID2
keywords: scfconv7
keywords: smallprint printgap noloewdin
keywords: NOSOSCF
formula: C14H17N2O4PS
InChI: InChI=1/C14H17N2O4PS/c1-3-18-21(22,19-4-2)20-13-10-11-14(17)16(15-13)12-8-6-5-7-9-12/h5-11H,3-4H2,1-2H3
39 atoms
S  1.633743 -0.748565 -2.380408
P  2.243806 -0.169178 -0.662686
O  1.696229 1.315484 -0.200353
O  3.79832 0.118732 -0.620768
O  1.958647 -1.074299 0.608383
O  -3.501285 2.324413 0.308269
N  -1.748424 0.876122 0.143722
N  -0.445804 0.617258 -0.00082
C  -2.571992 -0.287577 0.099738
C  0.383809 1.588182 -0.046256
C  -2.29552 2.143775 0.228879
C  -0.000282 2.95464 0.06262
C  -1.312612 3.210454 0.201975
C  -3.519261 -0.526545 1.085823
C  -2.376398 -1.197545 -0.931452
C  4.648655 0.05947 0.546906
C  1.049351 -2.195519 0.647535
C  -4.278768 -1.686234 1.028922
C  -3.1358 -2.356641 -0.97402
C  -4.091999 -2.601289 0.001976
C  4.380894 1.157008 1.546077
C  0.341381 -2.202045 1.976661
H  0.743406 3.739859 0.029275
H  -1.68541 4.222646 0.279833
H  -3.65724 0.167537 1.903105
H  -1.628056 -1.006287 -1.690113
H  4.563813 -0.926255 1.005977
H  5.655662 0.149377 0.143087
H  0.337843 -2.130029 -0.175291
H  1.641788 -3.100912 0.51042
H  -5.016809 -1.875649 1.797123
H  -2.978688 -3.06684 -1.775153
H  -4.685925 -3.505222 -0.034454
H  4.429538 2.143333 1.084434
H  3.418281 1.046379 2.044811
H  5.152535 1.113582 2.315942
H  -0.326585 -3.063077 2.017594
H  1.04155 -2.284027 2.80845
H  -0.260921 -1.304316 2.115275
elementType: S P O N C H
totalener: -1693.88367804 hartree
nucrepener: 2247.61528177 hartree
electener: -3941.49895982 hartree
oneelecener: -6793.54141854 hartree
twoeener: 2852.04245872 hartree
cpcmener: -0.03161610 hartree
kineticenergy: 1688.39150708 hartree
xcener: -126.687863440797 hartree
chargesum: -0.0000000
charge: -0.425996 0.727223 -0.311608 -0.346811 -0.328574 -0.518993 0.113324 -0.257448 0.164396 0.346374 0.355184 -0.149822 -0.150378 -0.216859 -0.249911 0.038800 0.057619 -0.114354 -0.099733 -0.161502 -0.250916 -0.261324 0.161035 0.151609 0.146750 0.138280 0.095744 0.108462 0.087358 0.121117 0.158269 0.157785 0.158743 0.090805 0.085473 0.100289 0.094617 0.100636 0.084336
qa: -0.4260 0.7272 -0.3116 -0.3468 -0.3286 -0.5190 0.1133 -0.2574 0.1644 0.3464 0.3552 -0.1498 -0.1504 -0.2169 -0.2499 0.0388 0.0576 -0.1144 -0.0997 -0.1615 -0.2509 -0.2613 0.1610 0.1516 0.1467 0.1383 0.0957 0.1085 0.0874 0.1211 0.1583 0.1578 0.1587 0.0908 0.0855 0.1003 0.0946 0.1006 0.0843
va: 2.0157 5.4956 2.1456 2.1405 2.0651 1.9963 3.2301 2.9285 3.5396 4.0177 4.1862 3.9344 3.8926 4.0094 3.9841 3.8664 3.7850 3.8892 3.8828 3.9163 3.9051 3.9466 0.9957 1.0011 1.0154 1.0312 1.0002 0.9871 1.0176 0.9997 0.9910 0.9908 0.9896 1.0046 1.0132 1.0090 1.0067 1.0049 1.0050
dispcorr: -0.021787300 hartree
energy: -1693.905465344053
dipole: 3.98113 -2.28485 1.69629 -8.93026 8.50999 -0.42027 14.73344 -12.60255 2.13089
magnitude: 2.75585 au
magnitude: 7.00481 debye
