program: Orca
programVersion: 5.0.2
elementType: S P O O O O N N C C C C C C C C C C C C C C H H H H H H H H H H H H H H H H H
charge: 0
multiplicity: 1
keywords: wb97x-d3
keywords: def2-TZVPP
keywords: def2/J RIJCOSX
keywords: DEFGRID2
keywords: scfconv7
keywords: smallprint printgap noloewdin
keywords: NOSOSCF
formula: C14H17N2O4PS
InChI: InChI=1/C14H17N2O4PS/c1-3-18-21(22,19-4-2)20-13-10-11-14(17)16(15-13)12-8-6-5-7-9-12/h5-11H,3-4H2,1-2H3
39 atoms
S  1.157014 -1.785387 1.941306
P  2.030061 -0.453778 0.878712
O  1.479762 1.085069 1.04814
O  2.034715 -0.645813 -0.69844
O  3.538158 -0.233118 1.294735
O  -3.575523 2.417057 0.082991
N  -1.806257 0.995364 -0.122794
N  -0.544247 0.64043 0.134004
C  -2.569673 -0.019334 -0.771446
C  0.211974 1.453716 0.766176
C  -2.392648 2.182437 0.279006
C  -0.206188 2.743875 1.198284
C  -1.479946 3.09111 0.945921
C  -2.569823 -1.298277 -0.231631
C  -3.269063 0.259507 -1.937335
C  1.347368 -1.705055 -1.393523
C  4.389017 0.892991 0.985465
C  -3.276299 -2.307984 -0.867157
C  -3.980483 -0.75551 -2.55963
C  -3.98878 -2.037643 -2.027192
C  2.266574 -2.877328 -1.62261
C  4.698262 1.042896 -0.483326
H  0.485059 3.401651 1.708548
H  -1.876142 4.049678 1.252043
H  -2.014219 -1.505108 0.674414
H  -3.248093 1.249818 -2.371603
H  0.458312 -2.003552 -0.836861
H  1.019186 -1.265676 -2.334979
H  3.946308 1.803179 1.392104
H  5.300697 0.692585 1.54605
H  -3.274067 -3.305551 -0.447923
H  -4.526164 -0.541166 -3.469233
H  -4.544248 -2.825509 -2.519046
H  2.566774 -3.339263 -0.681315
H  1.746581 -3.631971 -2.214159
H  3.163491 -2.583568 -2.169137
H  5.464275 1.811774 -0.592134
H  5.092637 0.119883 -0.908501
H  3.834402 1.36004 -1.065814
elementType: S P O N C H
totalener: -1693.88353785 hartree
nucrepener: 2226.74399201 hartree
electener: -3920.62752986 hartree
oneelecener: -6751.95883958 hartree
twoeener: 2831.33130972 hartree
cpcmener: -0.03219800 hartree
kineticenergy: 1688.39120282 hartree
xcener: -126.687725931877 hartree
chargesum: 0.0000000
charge: -0.426337 0.734209 -0.312810 -0.325568 -0.344990 -0.517867 0.085355 -0.246895 0.192684 0.329368 0.349410 -0.146883 -0.147187 -0.246159 -0.215040 0.064867 0.037608 -0.105173 -0.122552 -0.159399 -0.240253 -0.249973 0.161628 0.151890 0.139675 0.150334 0.076988 0.109389 0.097887 0.108581 0.158061 0.158556 0.159021 0.079472 0.094747 0.091093 0.099320 0.090591 0.086353
qa: -0.4263 0.7342 -0.3128 -0.3256 -0.3450 -0.5179 0.0854 -0.2469 0.1927 0.3294 0.3494 -0.1469 -0.1472 -0.2462 -0.2150 0.0649 0.0376 -0.1052 -0.1226 -0.1594 -0.2403 -0.2500 0.1616 0.1519 0.1397 0.1503 0.0770 0.1094 0.0979 0.1086 0.1581 0.1586 0.1590 0.0795 0.0947 0.0911 0.0993 0.0906 0.0864
va: 2.0068 5.4875 2.1565 2.0722 2.1470 1.9980 3.2498 2.9318 3.5567 4.0450 4.1948 3.9226 3.8904 3.9895 4.0245 3.8190 3.8672 3.8838 3.8966 3.9116 3.9567 3.9231 0.9948 1.0010 1.0259 1.0096 1.0129 0.9920 0.9971 0.9862 0.9908 0.9908 0.9895 1.0152 1.0089 1.0046 1.0088 1.0050 1.0107
dispcorr: -0.020386813 hartree
energy: -1693.903924658045
dipole: 10.66032 -8.54418 2.11613 -5.38398 6.26758 0.88360 -13.55269 12.24503 -1.30766
magnitude: 2.63984 au
magnitude: 6.70994 debye
