program: Orca
programVersion: 5.0.2
elementType: S P O O O O N N C C C C C C C C C C C C C C H H H H H H H H H H H H H H H H H
charge: 0
multiplicity: 1
keywords: wb97x-d3
keywords: def2-TZVPP
keywords: def2/J RIJCOSX
keywords: DEFGRID2
keywords: scfconv7
keywords: smallprint printgap noloewdin
keywords: NOSOSCF
formula: C14H17N2O4PS
InChI: InChI=1/C14H17N2O4PS/c1-3-18-21(22,19-4-2)20-13-10-11-14(17)16(15-13)12-8-6-5-7-9-12/h5-11H,3-4H2,1-2H3
39 atoms
S  1.795428 -0.979905 -1.608925
P  2.189056 -0.279203 0.13138
O  1.600238 1.226269 0.428762
O  3.700249 -0.029197 0.537091
O  1.720741 -1.121209 1.389299
O  -3.536452 2.446864 -0.204588
N  -1.861043 0.930109 0.101675
N  -0.570781 0.615738 0.248953
C  -2.711425 -0.201031 -0.075263
C  0.296873 1.552445 0.29759
C  -2.351172 2.219353 -0.016199
C  -0.03376 2.935508 0.235619
C  -1.333572 3.247115 0.094142
C  -3.872651 -0.347064 0.670591
C  -2.335515 -1.167392 -0.999669
C  4.545929 1.035674 0.05329
C  0.944506 -2.334394 1.312407
C  -4.668182 -1.466473 0.471757
C  -3.133518 -2.285466 -1.18394
C  -4.306027 -2.433319 -0.456004
C  4.793976 1.000978 -1.434654
C  1.841914 -3.545034 1.275901
H  0.740141 3.688895 0.301597
H  -1.665066 4.274586 0.031177
H  -4.152336 0.38919 1.411517
H  -1.42207 -1.047106 -1.568418
H  4.125713 1.995221 0.359328
H  5.479551 0.897617 0.596337
H  0.321381 -2.329513 2.205722
H  0.28402 -2.30473 0.444868
H  -5.574658 -1.582927 1.051343
H  -2.839441 -3.036821 -1.905206
H  -4.932807 -3.30286 -0.606069
H  5.160999 0.027854 -1.760447
H  3.905821 1.249477 -2.013496
H  5.559546 1.74196 -1.668433
H  2.444823 -3.570466 0.36782
H  2.507615 -3.576863 2.138704
H  1.228058 -4.446195 1.294059
elementType: S P O N C H
totalener: -1693.88227513 hartree
nucrepener: 2221.49306380 hartree
electener: -3915.37533894 hartree
oneelecener: -6741.65287119 hartree
twoeener: 2826.27753225 hartree
cpcmener: -0.03037704 hartree
kineticenergy: 1688.39452259 hartree
xcener: -126.688946429902 hartree
chargesum: -0.0000000
charge: -0.434297 0.762118 -0.315644 -0.343170 -0.342064 -0.517659 0.081782 -0.248161 0.196181 0.330076 0.353108 -0.145770 -0.148494 -0.219396 -0.239520 0.041706 0.066448 -0.121687 -0.112160 -0.160723 -0.250175 -0.240510 0.161126 0.151746 0.149560 0.142705 0.100130 0.106926 0.110082 0.074774 0.158290 0.157409 0.159146 0.089520 0.082349 0.100757 0.077374 0.091976 0.094141
qa: -0.4343 0.7621 -0.3156 -0.3432 -0.3421 -0.5177 0.0818 -0.2482 0.1962 0.3301 0.3531 -0.1458 -0.1485 -0.2194 -0.2395 0.0417 0.0664 -0.1217 -0.1122 -0.1607 -0.2502 -0.2405 0.1611 0.1517 0.1496 0.1427 0.1001 0.1069 0.1101 0.0748 0.1583 0.1574 0.1591 0.0895 0.0823 0.1008 0.0774 0.0920 0.0941
va: 1.9773 5.4776 2.1612 2.1424 2.1095 1.9974 3.2523 2.9255 3.5818 4.0448 4.1898 3.9231 3.8938 4.0256 3.9822 3.8565 3.8325 3.8952 3.8948 3.9138 3.9131 3.9466 0.9950 1.0013 1.0117 1.0280 0.9977 0.9857 0.9923 1.0118 0.9910 0.9913 0.9893 1.0077 1.0139 1.0099 1.0165 1.0057 1.0076
dispcorr: -0.019894109 hartree
energy: -1693.902169241594
dipole: 8.05360 -6.34442 1.70918 -9.46474 9.72901 0.26427 0.80351 0.12506 0.92857
magnitude: 1.96300 au
magnitude: 4.98956 debye
