program: Orca
programVersion: 5.0.2
elementType: S P O O O O N N C C C C C C C C C C C C C C H H H H H H H H H H H H H H H H H
charge: 0
multiplicity: 1
keywords: wb97x-d3
keywords: def2-TZVPP
keywords: def2/J RIJCOSX
keywords: DEFGRID2
keywords: scfconv7
keywords: smallprint printgap noloewdin
keywords: NOSOSCF
formula: C14H17N2O4PS
InChI: InChI=1/C14H17N2O4PS/c1-3-18-21(22,19-4-2)20-13-10-11-14(17)16(15-13)12-8-6-5-7-9-12/h5-11H,3-4H2,1-2H3
39 atoms
S  1.086268 -1.5824 1.832215
P  1.952142 -0.254526 0.753904
O  1.400269 1.279878 0.909799
O  2.00077 -0.503679 -0.81316
O  3.447305 0.139658 1.108089
O  -3.650045 2.555271 -0.151241
N  -1.862913 1.151395 -0.316722
N  -0.601957 0.812504 -0.035089
C  -2.598902 0.126685 -0.981505
C  0.131947 1.632744 0.613224
C  -2.469388 2.332293 0.070212
C  -0.309572 2.916928 1.040568
C  -1.581797 3.248686 0.761113
C  -3.265803 0.393759 -2.168337
C  -2.602559 -1.149539 -0.435199
C  1.239356 -1.508527 -1.513819
C  4.464796 -0.879478 1.235148
C  -3.94974 -0.6310 -2.805823
C  -3.281033 -2.168698 -1.085761
C  -3.961686 -1.910571 -2.267559
C  2.090274 -2.723681 -1.779813
C  4.804533 -1.111364 2.684575
H  0.361214 3.583096 1.566834
H  -1.995378 4.201838 1.061242
H  -3.240652 1.382276 -2.606515
H  -2.07138 -1.348336 0.487097
H  0.346366 -1.771517 -0.945904
H  0.918237 -1.035207 -2.441355
H  4.14895 -1.809659 0.755026
H  5.325335 -0.505569 0.681167
H  -4.46911 -0.426416 -3.732813
H  -3.281277 -3.164259 -0.661497
H  -4.495523 -2.705869 -2.771164
H  2.366367 -3.229818 -0.853523
H  1.525014 -3.430682 -2.388954
H  3.000418 -2.467815 -2.324049
H  5.621575 -1.831131 2.749142
H  5.13079 -0.191867 3.171428
H  3.956088 -1.516691 3.235545
elementType: S P O N C H
totalener: -1693.88494674 hartree
nucrepener: 2217.01826805 hartree
electener: -3910.90321479 hartree
oneelecener: -6732.58182378 hartree
twoeener: 2821.67860900 hartree
cpcmener: -0.03035395 hartree
kineticenergy: 1688.40094687 hartree
xcener: -126.687864582766 hartree
chargesum: 0.0000000
charge: -0.435867 0.755513 -0.314491 -0.338148 -0.337031 -0.518310 0.084890 -0.251497 0.187672 0.333362 0.350734 -0.149146 -0.145928 -0.215767 -0.245394 0.079800 0.039983 -0.120998 -0.103961 -0.159473 -0.252304 -0.236533 0.162003 0.151986 0.150885 0.139077 0.075206 0.109697 0.085924 0.108064 0.158658 0.157901 0.158730 0.079468 0.099280 0.094667 0.093794 0.090904 0.076650
qa: -0.4359 0.7555 -0.3145 -0.3381 -0.3370 -0.5183 0.0849 -0.2515 0.1877 0.3334 0.3507 -0.1491 -0.1459 -0.2158 -0.2454 0.0798 0.0400 -0.1210 -0.1040 -0.1595 -0.2523 -0.2365 0.1620 0.1520 0.1509 0.1391 0.0752 0.1097 0.0859 0.1081 0.1587 0.1579 0.1587 0.0795 0.0993 0.0947 0.0938 0.0909 0.0767
va: 1.9800 5.5027 2.1935 2.0907 2.1159 1.9976 3.2474 2.9324 3.5537 4.0355 4.1931 3.9292 3.8888 4.0253 3.9876 3.8013 3.8879 3.8950 3.8816 3.9124 3.9504 3.9345 0.9951 1.0009 1.0094 1.0271 1.0164 0.9927 0.9958 0.9953 0.9907 0.9908 0.9896 1.0117 1.0102 1.0036 1.0078 1.0042 1.0185
dispcorr: -0.020211304 hartree
energy: -1693.905158038883
dipole: 11.05412 -8.97539 2.07874 -14.51988 13.94050 -0.57939 -5.83323 4.98241 -0.85083
magnitude: 2.31964 au
magnitude: 5.89606 debye
