program: Orca
programVersion: 5.0.2
elementType: S P O O O O N N C C C C C C C C C C C C C C H H H H H H H H H H H H H H H H H
charge: 0
multiplicity: 1
keywords: wb97x-d3
keywords: def2-TZVPP
keywords: def2/J RIJCOSX
keywords: DEFGRID2
keywords: scfconv7
keywords: smallprint printgap noloewdin
keywords: NOSOSCF
formula: C14H17N2O4PS
InChI: InChI=1/C14H17N2O4PS/c1-3-18-21(22,19-4-2)20-13-10-11-14(17)16(15-13)12-8-6-5-7-9-12/h5-11H,3-4H2,1-2H3
39 atoms
S  1.838202 -0.753085 -1.65705
P  2.142949 -0.015521 0.085891
O  1.46795 1.457612 0.358064
O  3.629408 0.358008 0.486188
O  1.676663 -0.834719 1.360827
O  -3.757727 2.330926 -0.104446
N  -1.973568 0.927173 0.102597
N  -0.660797 0.698086 0.202438
C  -2.751462 -0.254707 -0.076945
C  0.140569 1.690677 0.272165
C  -2.554422 2.181071 0.04457
C  -0.286871 3.049147 0.271105
C  -1.608466 3.273474 0.171111
C  -3.857383 -0.506712 0.722048
C  -2.360251 -1.160054 -1.054257
C  4.681661 0.629217 -0.465395
C  1.08902 -2.151685 1.293219
C  -4.580996 -1.674497 0.528577
C  -3.086681 -2.326731 -1.234365
C  -4.200822 -2.584628 -0.447818
C  5.650972 -0.522548 -0.504742
C  2.144811 -3.224797 1.235356
H  0.43186 3.854195 0.348531
H  -2.011445 4.277028 0.155866
H  -4.146221 0.185002 1.501081
H  -1.491544 -0.958193 -1.667908
H  4.261131 0.820906 -1.453865
H  5.164165 1.544786 -0.124796
H  0.489329 -2.235952 2.19806
H  0.414071 -2.211452 0.438267
H  -5.442165 -1.87448 1.152456
H  -2.781714 -3.031139 -1.997065
H  -4.76999 -3.493466 -0.593032
H  6.07821 -0.721573 0.478419
H  5.174474 -1.433037 -0.869394
H  6.47102 -0.280472 -1.181879
H  2.818093 -3.173277 2.091392
H  1.660904 -4.202668 1.248914
H  2.736029 -3.161579 0.321053
elementType: S P O N C H
totalener: -1693.88446255 hartree
nucrepener: 2210.66352055 hartree
electener: -3904.54798310 hartree
oneelecener: -6720.10144432 hartree
twoeener: 2815.55346122 hartree
cpcmener: -0.02973446 hartree
kineticenergy: 1688.40128287 hartree
xcener: -126.688388409065 hartree
chargesum: -0.0000000
charge: -0.436816 0.771729 -0.317811 -0.343175 -0.343574 -0.518468 0.077203 -0.245257 0.194637 0.328047 0.352203 -0.146675 -0.148473 -0.216920 -0.238512 0.043876 0.063445 -0.122302 -0.111238 -0.159877 -0.231432 -0.236760 0.160818 0.151501 0.149156 0.142303 0.085453 0.106774 0.110872 0.080411 0.158311 0.156898 0.159232 0.090533 0.077598 0.094001 0.092817 0.095277 0.074192
qa: -0.4368 0.7717 -0.3178 -0.3432 -0.3436 -0.5185 0.0772 -0.2453 0.1946 0.3280 0.3522 -0.1467 -0.1485 -0.2169 -0.2385 0.0439 0.0634 -0.1223 -0.1112 -0.1599 -0.2314 -0.2368 0.1608 0.1515 0.1492 0.1423 0.0855 0.1068 0.1109 0.0804 0.1583 0.1569 0.1592 0.0905 0.0776 0.0940 0.0928 0.0953 0.0742
va: 1.9771 5.4728 2.1878 2.1196 2.0964 1.9969 3.2527 2.9179 3.5695 4.0394 4.1917 3.9281 3.8940 4.0229 3.9897 3.8437 3.8365 3.8963 3.8909 3.9119 3.9275 3.9423 0.9962 1.0012 1.0113 1.0235 1.0155 0.9958 0.9922 1.0089 0.9910 0.9914 0.9893 1.0042 1.0123 1.0091 1.0058 1.0087 1.0155
dispcorr: -0.019545081 hartree
energy: -1693.904007634192
dipole: 11.62189 -9.69467 1.92722 -14.64604 14.31663 -0.32941 1.98824 -1.28889 0.69934
magnitude: 2.07648 au
magnitude: 5.27799 debye
