program: Orca
programVersion: 5.0.2
elementType: S P O O O O N N C C C C C C C C C C C C C C H H H H H H H H H H H H H H H H H
charge: 0
multiplicity: 1
keywords: wb97x-d3
keywords: def2-TZVPP
keywords: def2/J RIJCOSX
keywords: DEFGRID2
keywords: scfconv7
keywords: smallprint printgap noloewdin
keywords: NOSOSCF
formula: C14H17N2O4PS
InChI: InChI=1/C14H17N2O4PS/c1-3-18-21(22,19-4-2)20-13-10-11-14(17)16(15-13)12-8-6-5-7-9-12/h5-11H,3-4H2,1-2H3
39 atoms
S  3.893656 -0.32021 -1.56166
P  2.351744 0.021553 -0.486403
O  1.202955 0.797041 -1.343555
O  2.484542 1.013567 0.747923
O  1.62181 -1.226509 0.179215
O  -3.366332 2.423803 0.864316
N  -2.019186 0.808589 -0.018032
N  -0.868602 0.397353 -0.546638
C  -2.924459 -0.251983 0.28496
C  0.053831 1.253386 -0.767961
C  -2.309831 2.119909 0.333891
C  -0.081727 2.642874 -0.499245
C  -1.248198 3.056762 0.0277
C  -2.442787 -1.34987 0.98624
C  -4.246261 -0.202263 -0.13433
C  3.666537 1.063393 1.575128
C  1.589105 -2.535029 -0.429051
C  -3.29344 -2.406469 1.271238
C  -5.090215 -1.262424 0.162241
C  -4.619841 -2.363046 0.865348
C  3.847771 -0.173089 2.420043
C  0.705065 -2.604994 -1.650393
H  0.727387 3.325448 -0.72189
H  -1.426765 4.096766 0.264809
H  -1.407624 -1.380002 1.302082
H  -4.616106 0.639105 -0.70366
H  4.537482 1.238187 0.940163
H  3.524507 1.943723 2.199017
H  2.610228 -2.841202 -0.66594
H  1.216973 -3.190997 0.356275
H  -2.916782 -3.261889 1.816478
H  -6.12086 -1.227816 -0.165464
H  -5.283882 -3.18712 1.091145
H  4.078725 -1.055086 1.82191
H  4.687057 -0.011055 3.097072
H  2.965372 -0.379682 3.025667
H  -0.317421 -2.300258 -1.43102
H  1.083746 -1.994579 -2.471234
H  0.679954 -3.638365 -1.998638
elementType: S P O N C H
totalener: -1693.88327823 hartree
nucrepener: 2215.41642526 hartree
electener: -3909.29970349 hartree
oneelecener: -6729.08422716 hartree
twoeener: 2819.78452367 hartree
cpcmener: -0.03068440 hartree
kineticenergy: 1688.40159516 hartree
xcener: -126.684642130173 hartree
chargesum: -0.0000000
charge: -0.414737 0.712876 -0.334823 -0.327789 -0.326278 -0.512854 0.111808 -0.225986 0.200163 0.289221 0.354779 -0.145011 -0.153932 -0.236556 -0.218136 0.017367 0.025457 -0.111608 -0.122025 -0.160191 -0.234692 -0.245753 0.163589 0.151014 0.143704 0.149135 0.095007 0.108041 0.104497 0.113246 0.158152 0.158580 0.159498 0.080542 0.099283 0.091978 0.091139 0.086430 0.104869
qa: -0.4147 0.7129 -0.3348 -0.3278 -0.3263 -0.5129 0.1118 -0.2260 0.2002 0.2892 0.3548 -0.1450 -0.1539 -0.2366 -0.2181 0.0174 0.0255 -0.1116 -0.1220 -0.1602 -0.2347 -0.2458 0.1636 0.1510 0.1437 0.1491 0.0950 0.1080 0.1045 0.1132 0.1582 0.1586 0.1595 0.0805 0.0993 0.0920 0.0911 0.0864 0.1049
va: 2.0322 5.5109 2.1298 2.1124 2.0706 2.0019 3.1950 2.9499 3.6026 4.0994 4.1904 3.9513 3.8943 3.9966 4.0262 3.8725 3.8213 3.8895 3.8970 3.9152 3.8906 3.9056 0.9937 1.0016 1.0205 1.0118 1.0079 0.9908 1.0127 0.9907 0.9912 0.9910 0.9893 1.0158 1.0093 1.0058 1.0062 1.0173 1.0110
dispcorr: -0.020227177 hartree
energy: -1693.903505406252
dipole: 1.77400 -0.98263 0.79137 -12.62774 11.92581 -0.70193 7.96719 -7.18865 0.77854
magnitude: 1.31343 au
magnitude: 3.33849 debye
