program: Orca
programVersion: 5.0.2
elementType: S P O O O O N N C C C C C C C C C C C C C C H H H H H H H H H H H H H H H H H
charge: 0
multiplicity: 1
keywords: wb97x-d3
keywords: def2-TZVPP
keywords: def2/J RIJCOSX
keywords: DEFGRID2
keywords: scfconv7
keywords: smallprint printgap noloewdin
keywords: NOSOSCF
formula: C14H17N2O4PS
InChI: InChI=1/C14H17N2O4PS/c1-3-18-21(22,19-4-2)20-13-10-11-14(17)16(15-13)12-8-6-5-7-9-12/h5-11H,3-4H2,1-2H3
39 atoms
S  1.020055 -1.531175 1.951376
P  1.930446 -0.202919 0.919737
O  1.363881 1.334266 0.998946
O  2.089216 -0.471833 -0.639555
O  3.395675 0.207165 1.374332
O  -3.466901 2.744126 -0.716952
N  -1.810614 1.183277 -0.457188
N  -0.595248 0.833494 -0.022399
C  -2.568589 0.087931 -0.963284
C  0.147163 1.696632 0.553427
C  -2.354452 2.46144 -0.329822
C  -0.240757 3.054478 0.755828
C  -1.4573 3.411831 0.315714
C  -3.371989 0.219569 -2.088479
C  -2.462777 -1.138291 -0.315131
C  1.285292 -1.40117 -1.385044
C  4.306214 -0.726631 1.963698
C  -4.067738 -0.884075 -2.557896
C  -3.160001 -2.232695 -0.798343
C  -3.968079 -2.109838 -1.918788
C  1.993719 -2.725686 -1.538206
C  4.874287 -1.704217 0.958983
H  0.432085 3.747435 1.242565
H  -1.835622 4.417622 0.432673
H  -3.458202 1.163742 -2.602604
H  -1.829401 -1.237996 0.557047
H  0.314066 -1.533418 -0.909176
H  1.117916 -0.92646 -2.351512
H  5.095528 -0.109283 2.390665
H  3.809836 -1.254682 2.781298
H  -4.691995 -0.778784 -3.435009
H  -3.074725 -3.182574 -0.287772
H  -4.516792 -2.964362 -2.291483
H  1.409962 -3.374663 -2.191613
H  2.982318 -2.605228 -1.980888
H  2.095101 -3.228541 -0.576683
H  5.662598 -2.290612 1.431552
H  4.11764 -2.401219 0.600927
H  5.304873 -1.189021 0.101163
totalener: -1693.86087794 hartree
nucrepener: 2229.40751455 hartree
electener: -3923.26839250 hartree
oneelecener: -6756.68057478 hartree
twoeener: 2833.41218228 hartree
kineticenergy: 1688.45179407 hartree
xcener: -126.697867893701 hartree
chargesum: -0.0000000
charge: -0.388478 0.715637 -0.302395 -0.315223 -0.305177 -0.395377 0.054966 -0.251793 0.174748 0.328352 0.297326 -0.157306 -0.149401 -0.152400 -0.224147 0.078323 0.014064 -0.108754 -0.092236 -0.130797 -0.269406 -0.241386 0.142820 0.137081 0.122879 0.134966 0.074579 0.097736 0.096875 0.093370 0.126049 0.128932 0.126727 0.094447 0.095592 0.082810 0.090003 0.082974 0.093021
qa: -0.3885 0.7156 -0.3024 -0.3152 -0.3052 -0.3954 0.0550 -0.2518 0.1747 0.3284 0.2973 -0.1573 -0.1494 -0.1524 -0.2241 0.0783 0.0141 -0.1088 -0.0922 -0.1308 -0.2694 -0.2414 0.1428 0.1371 0.1229 0.1350 0.0746 0.0977 0.0969 0.0934 0.1260 0.1289 0.1267 0.0944 0.0956 0.0828 0.0900 0.0830 0.0930
va: 2.0277 5.5185 2.2135 2.1064 2.1458 2.1148 3.2715 2.9345 3.6962 4.0546 4.2602 3.9267 3.8839 4.0550 3.9863 3.8256 3.8960 3.9589 3.9436 3.9651 3.9425 3.8922 1.0032 1.0081 1.0264 1.0361 1.0167 0.9954 0.9919 1.0122 1.0009 1.0002 0.9991 1.0153 1.0002 1.0130 1.0125 1.0096 1.0068
dispcorr: -0.020706693 hartree
energy: -1693.881584636879
dipole: 10.71591 -9.31289 1.40302 -16.00675 15.67508 -0.33168 -7.74732 7.37731 -0.37001
magnitude: 1.48842 au
magnitude: 3.78325 debye
