program: Gaussian 09
title: 000066538
version: EM64L-G09RevD.01
frameworkgroup: C1[X(C12H10Cl2N2)]
method: RPBEPBE
basis: SDD
operation: Freq
keyword: #p
keyword: freq=noraman
keyword: PBEPBE/SDD
title: #p freq=noraman PBEPBE/SDD
converged: NO NO NO NO
title: Mulliken charges:
elementType: Cl Cl N N C C C C C C C C C C C C H H H H H H H H H H
charge: -0.065268 -0.065264 -0.701132 -0.701132 0.373093 0.373094 -0.260600 -0.260604 -0.326737 -0.326736 0.522424 0.522422 -0.429192 -0.429191 -0.435522 -0.435522 0.242187 0.242187 0.244644 0.244646 0.219066 0.219067 0.308017 0.309018 0.308017 0.309018
chargesum: 0.00000
title: Mulliken charges with hydrogens summed into heavy atoms:
elementType: Cl Cl N N C C C C C C C C C C C C
charge: -0.065268 -0.065264 -0.084096 -0.084097 0.373093 0.373094 -0.260600 -0.260604 -0.084549 -0.084549 0.522424 0.522422 -0.184548 -0.184546 -0.216455 -0.216455
polarizability: 2.49474860e+02 -1.63175893e+01 1.24615268e+02 9.16673762e-05 1.09088763e-04 1.25023778e+02
1716.lowfreq: -23.2684 -7.7618 -4.3240 -0.0021 -0.0014 0.0023 2.3298 47.0195 48.2697
frequency: -23.2397 47.0166 48.2695 127.5819 137.2496 177.5379 186.1514 196.9190 237.9519 285.3072 336.0824 338.7259 360.8818 360.9895 367.1183 367.2456 399.6257 410.0744 432.1298 432.3078 487.0274 487.8166 524.3532 600.1213 601.4943 666.3551 675.4650 677.7611 723.8146 724.2828 812.6075 814.3948 848.0680 848.2533 867.3324 881.3175 943.1445 943.7439 975.5170 1019.2767 1030.0391 1032.1958 1075.8700 1144.7603 1145.2998 1233.5130 1240.2379 1288.3473 1314.4025 1331.3789 1356.8117 1358.1912 1422.8296 1423.8505 1487.4760 1529.1524 1554.7357 1555.0902 1630.1039 1632.3832 1644.0762 1645.5421 3123.7821 3124.0916 3146.0876 3146.1745 3150.5038 3150.9041 3568.6439 3568.9919 3708.7082 3708.7201
redmass: 8.7989 6.4070 5.8233 6.5725 5.7225 6.3688 5.2904 5.3861 5.6047 6.0740 4.2214 3.7844 1.2858 1.3006 1.0940 1.0890 5.3481 5.9380 2.8837 2.8759 4.8549 4.8955 6.8905 3.1773 3.2302 5.7569 6.9408 6.5712 3.4419 3.4600 1.4431 1.4414 1.6927 1.6927 5.7228 5.7950 1.3682 1.3563 5.9546 2.7258 1.4694 1.5141 2.1140 1.2967 1.2937 1.4185 1.4273 1.7501 2.3205 5.4320 4.4859 4.4962 3.9225 3.9362 3.4826 4.4408 7.1536 7.0316 3.2313 2.9629 1.4287 1.5235 1.0876 1.0876 1.0928 1.0927 1.0960 1.0961 1.0449 1.0451 1.1040 1.1040
irintensity: 0.2018 3.9042 4.2104 0.0049 0.2416 3.0562 3.4414 0.6346 0.9524 0.0156 30.3199 34.6280 228.0654 216.4812 54.9588 57.9212 3.2812 2.0542 0.0012 0.0886 10.6779 13.0930 8.0972 12.2949 11.6153 0.9345 10.0015 3.7423 0.2534 0.0792 25.5498 28.0071 43.6682 42.8448 58.3779 24.4378 0.6107 0.1005 10.7077 31.3374 8.8629 0.5045 18.5019 1.6573 6.1499 0.0100 65.2051 5.0791 72.7204 1.4182 28.1330 28.9762 5.4567 1.4556 277.8178 6.0818 34.4179 32.4153 130.2322 1.6023 665.7028 0.9822 32.1623 2.2775 15.7699 7.3977 15.2937 9.5388 174.1467 0.1829 21.9308 21.9366
temp: 298.150 k
press: 1.00000 atm
elementType: 17 17 7 7 6 6 6 6 6 6 6 6 6 6 6 6 1 1 1 1 1 1 1 1 1 1
symmnumber: 1
zpe: 501499.7 jmol-1
zpe.correction: 0.191011 hartree
zpe.thermalcorrener: 0.205255 hartree
zpe.thermalcorrenthalpy: 0.206199 hartree
zpe.thermalcorrgfe: 0.149910 hartree
zpe.sumelectzpe: -1491.789615 hartree
zpe.sumelectthermal: -1491.775371 hartree
zpe.sumelectthermalent: -1491.774427 hartree
zpe.sumelectthermalfe: -1491.830716 hartree
dipole: 0.0001 0.0001 -2.5582
dipole: 2.5582
quadrupole: -52.7234 -108.9796 -106.6739
quadrupole: -4.5910 -0.0010 0.0000
quadrupole: 36.7356 -19.5206 -17.2150 -4.5910 -0.0010 0.0000
hfenergy: -1491.9806261 hartree
pointgroup: C01 [X(C12H10Cl2N2)]
dipole: -0.000013 0.0004724 1.006469 debye
dipolederiv: -0.2726168 -0.1478559 0.1511703 -0.1776255 -0.3738534 0.2993297 0.1714335 0.3002543 -0.3693785 -0.2726179 -0.1479848 -0.1510482 -0.1777754 -0.374352 -0.2993273 -0.1712839 -0.3002472 -0.3688737 -1.7519033 -0.0586756 0.0788955 -0.03235 -0.4343446 -0.3105816 0.0488278 -0.3104656 -0.4231376 -1.7519039 -0.0587055 -0.0788619 -0.0322869 -0.4338391 0.3105941 -0.0488796 0.3104686 -0.4236416 0.1197841 -0.1091615 0.0488855 -0.0838338 -0.2560684 0.17915 0.0296161 0.1839961 -0.2606198 0.1197863 -0.1092005 -0.0487965 -0.0838661 -0.2563698 -0.1791562 -0.0295523 -0.1839941 -0.2603151 0.533192 0.1193117 -0.1156619 0.164096 0.510621 -0.5115033 -0.15565 -0.5339832 0.5184934 0.5331914 0.1194194 0.1155579 0.164238 0.5114912 0.5115129 0.1555072 0.5339838 0.5176199 0.1784193 0.173849 -0.1687335 0.0687949 0.0654517 -0.1489058 -0.0772143 -0.1287489 0.0525882 0.1784234 0.1739817 0.1685915 0.0688539 0.065683 0.1488982 0.0771632 0.1287334 0.0523545 1.8537678 0.061819 -0.0586651 0.0764242 0.1194133 0.0354475 -0.0472253 0.0345114 0.1161712 1.8537643 0.0618491 0.0586133 0.0764469 0.1193558 -0.0354513 0.0471529 -0.0345107 0.1162287 -0.5992456 -0.0098875 0.0193801 -0.3158258 -0.2084142 0.0053368 0.3256348 0.0097975 -0.2008736 -0.5992487 -0.0099106 -0.0193635 -0.3160987 -0.2084186 -0.0053245 -0.3253615 -0.009795 -0.2008657 -0.5197283 -0.064294 0.0793085 0.2697765 -0.0979598 -0.1396043 -0.2601503 -0.1383448 -0.0988591 -0.5197278 -0.0643538 -0.0792528 0.2699868 -0.0977373 0.1395982 0.2599377 0.1383425 -0.0990866 0.0603023 0.0560727 -0.0642526 0.0671503 0.0389711 0.08588 -0.0738576 0.0844084 0.0435976 0.0603034 0.0561255 0.0642068 0.0672137 0.0388299 -0.0858775 0.0738001 -0.0844044 0.0437373 -0.0134685 0.052658 -0.0519422 0.052317 0.0827625 0.0894837 -0.0597603 0.0913839 0.0784695 -0.0134649 0.0527008 0.0518964 0.0523689 0.0826083 -0.0894922 0.0597145 -0.0913844 0.0786226 -0.0353222 -0.0747409 0.0769685 -0.0773234 0.0489808 0.1212002 0.0714519 0.1179966 0.0475099 -0.0353249 -0.0748062 -0.0769076 -0.0773839 0.0487849 -0.1211996 -0.0713859 -0.1179954 0.0477095 0.2207817 0.0069643 -0.0136185 0.0239942 0.2514147 0.1315772 -0.041023 0.1301823 0.252357 0.2260365 -0.0060674 -0.0001674 -0.0356123 0.2530042 0.1344917 0.0186972 0.1353797 0.2437023 0.2207829 0.0069683 0.0136194 0.0239883 0.2511864 -0.1315819 0.0410393 -0.1301757 0.2525818 0.2260375 -0.0060751 0.000178 -0.0356676 0.2527982 -0.1344947 -0.018632 -0.135389 0.2439078 unknown
polarizability: 250.2721466|12.88717|123.8179814|-0.0060243|0.0003169|125.0237778 unknown
InChI: InChI=1S/C12H10Cl2N2/c13-11-5-7(15)1-3-9(11)10-4-2-8(16)6-12(10)14/h1-6H,15-16H2
charge 0 multiplicity 1
26 atoms
Cl -0.735558 1.956893 -1.77477
Cl 0.73552 -1.958298 -1.77316
N  -5.030351 -0.14589 0.291072
N  5.030329 0.146179 0.290909
C  -0.748556 -0.016731 0.224256
C  0.748534 0.016971 0.224232
C  -1.546258 0.800802 -0.613152
C  1.546228 -0.80124 -0.612523
C  -1.459327 -0.88299 1.09843
C  1.459313 0.883942 1.097694
C  -3.636531 -0.103255 0.27352
C  3.636506 0.103541 0.273396
C  -2.950564 0.778915 -0.609941
C  2.950533 -0.779344 -0.609346
C  -2.864178 -0.936588 1.135098
C  2.864164 0.937572 1.134305
H  -0.877415 -1.535693 1.758905
H  0.877407 1.537193 1.757633
H  -3.508849 1.435238 -1.28581
H  3.508805 -1.436238 -1.284665
H  -3.368162 -1.624971 1.823906
H  3.368161 1.626515 1.822542
H  -5.522195 -0.781519 0.911713
H  -5.57959 0.439248 -0.33109
H  5.522176 0.782359 0.910983
H  5.579558 -0.43941 -0.330834
