program: Orca
programVersion: 5.0.2
elementType: S P O O O O N N C C C C C C C C C C C C C C H H H H H H H H H H H H H H H H H
charge: 0
multiplicity: 1
keywords: wb97x-d3
keywords: def2-TZVPP
keywords: def2/J RIJCOSX
keywords: DEFGRID2
keywords: scfconv7
keywords: smallprint printgap noloewdin
keywords: NOSOSCF
formula: C14H17N2O4PS
InChI: InChI=1/C14H17N2O4PS/c1-3-18-21(22,19-4-2)20-13-10-11-14(17)16(15-13)12-8-6-5-7-9-12/h5-11H,3-4H2,1-2H3
39 atoms
S  1.179246 -1.873581 1.548405
P  2.105479 -0.515278 0.568646
O  1.604913 1.023406 0.88683
O  2.138055 -0.583773 -1.010597
O  3.649109 -0.308661 0.87284
O  -3.482293 2.450719 0.252738
N  -1.72051 1.056087 -0.178051
N  -0.444526 0.697128 -0.012738
C  -2.482372 0.121568 -0.936386
C  0.321153 1.402241 0.726816
C  -2.314302 2.17194 0.411594
C  -0.110648 2.585349 1.395297
C  -1.393113 2.949058 1.230561
C  -2.308735 -1.232637 -0.67707
C  -3.355727 0.54333 -1.928899
C  1.339365 -1.486415 -1.794518
C  4.173315 -0.434315 2.203638
C  -3.008015 -2.167227 -1.422359
C  -4.053983 -0.402408 -2.663543
C  -3.885325 -1.755893 -2.415017
C  0.80074 -0.757103 -2.999137
C  4.86222 -1.766748 2.377725
H  0.580562 3.149564 2.006723
H  -1.804709 3.826043 1.710166
H  -1.626763 -1.550347 0.101792
H  -3.491938 1.593556 -2.136968
H  1.982505 -2.317659 -2.089109
H  0.525278 -1.889409 -1.191459
H  4.870655 0.39407 2.327742
H  3.38077 -0.316588 2.946671
H  -2.872956 -3.220448 -1.215373
H  -4.733911 -0.073618 -3.437881
H  -4.43608 -2.486909 -2.991802
H  0.139128 0.054655 -2.70255
H  1.600603 -0.352741 -3.618586
H  0.221197 -1.452159 -3.606717
H  5.65289 -1.903388 1.640814
H  5.312482 -1.820468 3.369309
H  4.15108 -2.586411 2.284736
totalener: -1693.86120904 hartree
nucrepener: 2235.35638452 hartree
electener: -3929.21759356 hartree
oneelecener: -6768.61331318 hartree
twoeener: 2839.39571962 hartree
kineticenergy: 1688.45106407 hartree
xcener: -126.694902245735 hartree
chargesum: 0.0000000
charge: -0.398192 0.736181 -0.312929 -0.311147 -0.312767 -0.393036 0.078470 -0.248050 0.139611 0.319698 0.296995 -0.145933 -0.155139 -0.216562 -0.142812 0.042622 0.020863 -0.098508 -0.103558 -0.123740 -0.241815 -0.222254 0.138080 0.135822 0.133013 0.119239 0.107848 0.085578 0.094371 0.079799 0.128553 0.125723 0.126727 0.087748 0.095678 0.082465 0.086599 0.079750 0.085006
qa: -0.3982 0.7362 -0.3129 -0.3111 -0.3128 -0.3930 0.0785 -0.2480 0.1396 0.3197 0.2970 -0.1459 -0.1551 -0.2166 -0.1428 0.0426 0.0209 -0.0985 -0.1036 -0.1237 -0.2418 -0.2223 0.1381 0.1358 0.1330 0.1192 0.1078 0.0856 0.0944 0.0798 0.1286 0.1257 0.1267 0.0877 0.0957 0.0825 0.0866 0.0797 0.0850
va: 2.0156 5.5066 2.1684 2.1384 2.1470 2.1213 3.2375 2.9350 3.6711 4.0661 4.2606 3.9297 3.8881 3.9948 4.0514 3.8200 3.9038 3.9489 3.9601 3.9592 3.9407 3.9188 1.0047 1.0082 1.0364 1.0255 0.9982 1.0208 0.9947 1.0101 1.0005 1.0010 0.9990 1.0080 1.0072 1.0094 1.0048 1.0112 1.0221
dispcorr: -0.020979868 hartree
energy: -1693.882188909694
dipole: 6.65706 -5.48696 1.17010 -8.64989 8.71359 0.06370 -6.55550 6.42974 -0.12575
magnitude: 1.17856 au
magnitude: 2.99566 debye
