program: Orca
programVersion: 5.0.2
elementType: S P O O O O N N C C C C C C C C C C C C C C H H H H H H H H H H H H H H H H H
charge: 0
multiplicity: 1
keywords: wb97x-d3
keywords: def2-TZVPP
keywords: def2/J RIJCOSX
keywords: DEFGRID2
keywords: scfconv7
keywords: smallprint printgap noloewdin
keywords: NOSOSCF
formula: C14H17N2O4PS
InChI: InChI=1/C14H17N2O4PS/c1-3-18-21(22,19-4-2)20-13-10-11-14(17)16(15-13)12-8-6-5-7-9-12/h5-11H,3-4H2,1-2H3
39 atoms
S  1.790151 -0.516473 -1.945042
P  2.17711 0.025895 -0.151297
O  1.531735 1.448314 0.344323
O  3.666648 0.454603 0.193232
O  1.830672 -1.00572 1.008628
O  -3.733292 2.209938 0.339386
N  -1.905706 0.837695 0.228478
N  -0.582377 0.652049 0.225647
C  -2.648693 -0.350159 -0.030936
C  0.199856 1.652687 0.353707
C  -2.529619 2.07823 0.360739
C  -0.26175 2.992207 0.513716
C  -1.591124 3.182371 0.520037
C  -3.781492 -0.665459 0.706558
C  -2.192715 -1.209266 -1.02392
C  4.763846 -0.3794 -0.206281
C  0.9291 -2.116257 0.874788
C  -4.453934 -1.849034 0.444575
C  -2.87136 -2.390924 -1.271956
C  -4.004797 -2.714375 -0.540809
C  5.494597 0.232439 -1.377242
C  0.043302 -2.194761 2.093223
H  0.445666 3.80314 0.622128
H  -2.026824 4.16569 0.627371
H  -4.139943 -0.005184 1.48116
H  -1.308183 -0.956579 -1.595352
H  5.410022 -0.462529 0.66767
H  4.420744 -1.386957 -0.457377
H  0.333736 -2.01572 -0.03213
H  1.538007 -3.017051 0.775416
H  -5.335696 -2.094367 1.021086
H  -2.514785 -3.055069 -2.04787
H  -4.536478 -3.635359 -0.739345
H  4.852239 0.278514 -2.255418
H  5.841434 1.238452 -1.144206
H  6.36552 -0.375336 -1.624492
H  -0.609199 -3.063673 2.005719
H  0.623928 -2.299136 3.00937
H  -0.589686 -1.313393 2.178185
totalener: -1693.86081831 hartree
nucrepener: 2238.71982843 hartree
electener: -3932.58064673 hartree
oneelecener: -6775.29622246 hartree
twoeener: 2842.71557573 hartree
kineticenergy: 1688.45351457 hartree
xcener: -126.696099192962 hartree
chargesum: -0.0000000
charge: -0.394239 0.730292 -0.301832 -0.306711 -0.319820 -0.392595 0.080808 -0.261363 0.146556 0.327437 0.299996 -0.149044 -0.154764 -0.144812 -0.238744 0.017767 0.051157 -0.103314 -0.089713 -0.126966 -0.219844 -0.243639 0.142607 0.136852 0.119344 0.137775 0.095325 0.075086 0.086899 0.102158 0.126167 0.129762 0.126920 0.086537 0.085449 0.079111 0.084647 0.094338 0.084410
qa: -0.3942 0.7303 -0.3018 -0.3067 -0.3198 -0.3926 0.0808 -0.2614 0.1466 0.3274 0.3000 -0.1490 -0.1548 -0.1448 -0.2387 0.0178 0.0512 -0.1033 -0.0897 -0.1270 -0.2198 -0.2436 0.1426 0.1369 0.1193 0.1378 0.0953 0.0751 0.0869 0.1022 0.1262 0.1298 0.1269 0.0865 0.0854 0.0791 0.0846 0.0943 0.0844
va: 2.0221 5.5140 2.2027 2.1417 2.1121 2.1206 3.2353 2.9282 3.6564 4.0536 4.2578 3.9253 3.8851 4.0464 4.0027 3.9277 3.8047 3.9559 3.9462 3.9614 3.9235 3.9452 1.0031 1.0081 1.0271 1.0377 0.9943 1.0057 1.0268 0.9986 1.0009 1.0000 0.9990 1.0199 1.0060 1.0107 1.0090 1.0072 1.0085
dispcorr: -0.021241090 hartree
energy: -1693.882059396953
dipole: 6.41949 -5.32281 1.09668 -13.07994 12.53929 -0.54065 3.04743 -2.34297 0.70445
magnitude: 1.41112 au
magnitude: 3.58679 debye
