program: Orca
programVersion: 5.0.2
elementType: S P O O O O N N C C C C C C C C C C C C C C H H H H H H H H H H H H H H H H H
charge: 0
multiplicity: 1
keywords: wb97x-d3
keywords: def2-TZVPP
keywords: def2/J RIJCOSX
keywords: DEFGRID2
keywords: scfconv7
keywords: smallprint printgap noloewdin
keywords: NOSOSCF
formula: C14H17N2O4PS
InChI: InChI=1/C14H17N2O4PS/c1-3-18-21(22,19-4-2)20-13-10-11-14(17)16(15-13)12-8-6-5-7-9-12/h5-11H,3-4H2,1-2H3
39 atoms
S  1.22819 -1.506349 1.722408
P  2.071686 -0.163855 0.647882
O  1.468593 1.355667 0.821278
O  2.114902 -0.347353 -0.924485
O  3.590303 0.17825 0.957587
O  -3.624408 2.489897 -0.216307
N  -1.814191 1.096164 -0.348514
N  -0.537189 0.808651 -0.081168
C  -2.527093 0.02459 -0.959333
C  0.183187 1.655636 0.546222
C  -2.455333 2.279028 0.019928
C  -0.29852 2.925673 0.979829
C  -1.581613 3.217157 0.712643
C  -3.368495 0.248409 -2.039937
C  -2.339443 -1.260831 -0.465655
C  1.448496 -1.414512 -1.617194
C  4.229328 -0.153814 2.197888
C  -4.021844 -0.824901 -2.625084
C  -2.995878 -2.325142 -1.061588
C  -3.840981 -2.11123 -2.140379
C  2.343387 -2.62522 -1.737743
C  4.978213 -1.460512 2.082325
H  0.358713 3.608215 1.501524
H  -2.030071 4.153283 1.014095
H  -3.513687 1.243979 -2.430402
H  -1.675626 -1.426749 0.37356
H  0.513254 -1.662341 -1.114155
H  1.199335 -1.004718 -2.594966
H  4.906999 0.673471 2.407217
H  3.496847 -0.202067 3.006346
H  -4.676497 -0.649571 -3.468128
H  -2.850281 -3.32415 -0.672887
H  -4.357572 -2.943033 -2.600351
H  2.547917 -3.061983 -0.760346
H  1.8502 -3.384486 -2.345395
H  3.290526 -2.375397 -2.214785
H  5.699843 -1.432441 1.266565
H  5.521878 -1.655785 3.007063
H  4.29163 -2.289639 1.91557
totalener: -1693.86081175 hartree
nucrepener: 2222.15049426 hartree
electener: -3916.01130601 hartree
oneelecener: -6742.28722168 hartree
twoeener: 2826.27591567 hartree
kineticenergy: 1688.45166031 hartree
xcener: -126.695702256617 hartree
chargesum: -0.0000000
charge: -0.398523 0.736109 -0.310503 -0.313515 -0.313482 -0.392909 0.043953 -0.235562 0.199303 0.317527 0.293503 -0.147720 -0.153487 -0.155676 -0.237093 0.062076 0.023370 -0.105583 -0.091604 -0.129904 -0.231080 -0.224463 0.139266 0.136121 0.120834 0.134639 0.074825 0.097834 0.095427 0.083572 0.125836 0.128832 0.126039 0.076792 0.083107 0.090916 0.088246 0.082123 0.080853
qa: -0.3985 0.7361 -0.3105 -0.3135 -0.3135 -0.3929 0.0440 -0.2356 0.1993 0.3175 0.2935 -0.1477 -0.1535 -0.1557 -0.2371 0.0621 0.0234 -0.1056 -0.0916 -0.1299 -0.2311 -0.2245 0.1393 0.1361 0.1208 0.1346 0.0748 0.0978 0.0954 0.0836 0.1258 0.1288 0.1260 0.0768 0.0831 0.0909 0.0882 0.0821 0.0809
va: 2.0098 5.4961 2.1943 2.1249 2.1374 2.1218 3.2704 2.9316 3.6746 4.0621 4.2680 3.9232 3.8837 4.0663 4.0111 3.8588 3.8873 3.9566 3.9424 3.9658 3.9388 3.9101 1.0046 1.0080 1.0227 1.0314 1.0155 0.9945 0.9944 1.0143 1.0008 1.0001 0.9992 1.0192 1.0118 1.0060 1.0044 1.0125 1.0209
dispcorr: -0.019955491 hartree
energy: -1693.880767241063
dipole: 10.98198 -9.63895 1.34302 -14.25496 14.12935 -0.12562 -4.20715 4.08659 -0.12056
magnitude: 1.35426 au
magnitude: 3.44226 debye
